BDBM50253803 2-(4-chloro-6-(2,3-dimethylphenylamino)pyrimidin-2-ylthio)-2-phenylacetic acid::CHEMBL461409
SMILES: Cc1cccc(Nc2cc(Cl)nc(SC(C(O)=O)c3ccccc3)n2)c1C
InChI Key: InChIKey=SABFOCWZUFNJNB-UHFFFAOYSA-N
Data: 2 IC50  4 EC50
Activity Spreadsheet -- Enzyme Inhibition Constant Data from BindingDB
Found 6 hits for monomerid = 50253803
Trg + Lig
Ki
nM
ΔG°
kcal/mole
IC50
nM
Kd
nM
EC50/IC50
nM
koff
s-1
kon
M-1s-1
pHTemp
°C
Prostaglandin G/H synthase (cyclooxygenase)
(Ovis aries (Sheep))
BDBM50253803
(2-(4-chloro-6-(2,3-dimethylphenylamino)pyrimidin-2...)
Show SMILES Cc1cccc(Nc2cc(Cl)nc(SC(C(O)=O)c3ccccc3)n2)c1C
Show InChI InChI=1S/C20H18ClN3O2S/c1-12-7-6-10-15(13(12)2)22-17-11-16(21)23-20(24-17)27-18(19(25)26)14-8-4-3-5-9-14/h3-11,18H,1-2H3,(H,25,26)(H,22,23,24)
n/an/a>10n/an/an/an/an/an/a
Eberhard-Karls-University Tuebingen
Curated by ChEMBL
Assay Description
Inhibition of ovine COX1
J Med Chem 51: 8068-76 (2008)
Article DOI: 10.1021/jm801085s
BindingDB Entry DOI: 10.7270/Q2639QN4
Cyclooxygenase
(Homo sapiens (Human))
BDBM50253803
(2-(4-chloro-6-(2,3-dimethylphenylamino)pyrimidin-2...)
Show SMILES Cc1cccc(Nc2cc(Cl)nc(SC(C(O)=O)c3ccccc3)n2)c1C
Show InChI InChI=1S/C20H18ClN3O2S/c1-12-7-6-10-15(13(12)2)22-17-11-16(21)23-20(24-17)27-18(19(25)26)14-8-4-3-5-9-14/h3-11,18H,1-2H3,(H,25,26)(H,22,23,24)
NCI pathway
Reactome pathway
n/an/a>10n/an/an/an/an/an/a
Eberhard-Karls-University Tuebingen
Curated by ChEMBL
Assay Description
Inhibition of human recombinant COX2
J Med Chem 51: 8068-76 (2008)
Article DOI: 10.1021/jm801085s
BindingDB Entry DOI: 10.7270/Q2639QN4
Peroxisome proliferator-activated receptor
(Homo sapiens (Human))
BDBM50253803
(2-(4-chloro-6-(2,3-dimethylphenylamino)pyrimidin-2...)
Show SMILES Cc1cccc(Nc2cc(Cl)nc(SC(C(O)=O)c3ccccc3)n2)c1C
Show InChI InChI=1S/C20H18ClN3O2S/c1-12-7-6-10-15(13(12)2)22-17-11-16(21)23-20(24-17)27-18(19(25)26)14-8-4-3-5-9-14/h3-11,18H,1-2H3,(H,25,26)(H,22,23,24)
NCI pathway
Reactome pathway
n/an/an/an/a 3.00E+4n/an/an/an/a
Goethe University Frankfurt
Curated by ChEMBL
Assay Description
Activation of human Gal4-fused PPARgamma LBD transfected in HEK293T after 14 to 16 hrs by dual-glo luciferase reporter gene assay
J Med Chem 62: 2112-2126 (2019)
Article DOI: 10.1021/acs.jmedchem.8b01848
Peroxisome proliferator-activated receptor
(Homo sapiens (Human))
BDBM50253803
(2-(4-chloro-6-(2,3-dimethylphenylamino)pyrimidin-2...)
Show SMILES Cc1cccc(Nc2cc(Cl)nc(SC(C(O)=O)c3ccccc3)n2)c1C
Show InChI InChI=1S/C20H18ClN3O2S/c1-12-7-6-10-15(13(12)2)22-17-11-16(21)23-20(24-17)27-18(19(25)26)14-8-4-3-5-9-14/h3-11,18H,1-2H3,(H,25,26)(H,22,23,24)
NCI pathway
Reactome pathway
n/an/an/an/a 3.00E+4n/an/an/an/a
Goethe University Frankfurt
Curated by ChEMBL
Assay Description
Activation of human Gal4-fused PPARgamma LBD transfected in HEK293T after 14 to 16 hrs by dual-glo luciferase reporter gene assay
J Med Chem 62: 2112-2126 (2019)
Article DOI: 10.1021/acs.jmedchem.8b01848
Peroxisome proliferator-activated receptor
(Homo sapiens (Human))
BDBM50253803
(2-(4-chloro-6-(2,3-dimethylphenylamino)pyrimidin-2...)
Show SMILES Cc1cccc(Nc2cc(Cl)nc(SC(C(O)=O)c3ccccc3)n2)c1C
Show InChI InChI=1S/C20H18ClN3O2S/c1-12-7-6-10-15(13(12)2)22-17-11-16(21)23-20(24-17)27-18(19(25)26)14-8-4-3-5-9-14/h3-11,18H,1-2H3,(H,25,26)(H,22,23,24)
n/an/an/an/a 3.00E+4n/an/an/an/a
Goethe University Frankfurt
Curated by ChEMBL
Assay Description
Activation of human Gal4-fused PPARalpha LBD transfected in HEK293T after 14 to 16 hrs by dual-glo luciferase reporter gene assay
J Med Chem 62: 2112-2126 (2019)
Article DOI: 10.1021/acs.jmedchem.8b01848
Peroxisome proliferator-activated receptor
(Homo sapiens (Human))
BDBM50253803
(2-(4-chloro-6-(2,3-dimethylphenylamino)pyrimidin-2...)
Show SMILES Cc1cccc(Nc2cc(Cl)nc(SC(C(O)=O)c3ccccc3)n2)c1C
Show InChI InChI=1S/C20H18ClN3O2S/c1-12-7-6-10-15(13(12)2)22-17-11-16(21)23-20(24-17)27-18(19(25)26)14-8-4-3-5-9-14/h3-11,18H,1-2H3,(H,25,26)(H,22,23,24)
n/an/an/an/a 3.00E+4n/an/an/an/a
Goethe University Frankfurt
Curated by ChEMBL
Assay Description
Activation of human Gal4-fused PPARalpha LBD transfected in HEK293T after 14 to 16 hrs by dual-glo luciferase reporter gene assay
J Med Chem 62: 2112-2126 (2019)
Article DOI: 10.1021/acs.jmedchem.8b01848