BDBM50254016 6-(benzo[d][1,3]dioxol-5-yl(1H-imidazol-1-yl)methyl)benzo[d][1,3]dioxol-5-ol::CHEMBL459503::NSC-368272
SMILES: Oc1cc2OCOc2cc1C(c1ccc2OCOc2c1)n1ccnc1
InChI Key: InChIKey=SADZUGZPRKRGTC-UHFFFAOYSA-N
Data: 1 KI  1 IC50
Activity Spreadsheet -- Enzyme Inhibition Constant Data from BindingDB
Found 2 hits for monomerid = 50254016
Trg + Lig
Ki
nM
ΔG°
kcal/mole
IC50
nM
Kd
nM
EC50/IC50
nM
koff
s-1
kon
M-1s-1
pHTemp
°C
Cytochrome P450 19A1
(Homo sapiens (Human))
BDBM50254016
(6-(benzo[d][1,3]dioxol-5-yl(1H-imidazol-1-yl)methy...)
Show SMILES Oc1cc2OCOc2cc1C(c1ccc2OCOc2c1)n1ccnc1
Show InChI InChI=1S/C18H14N2O5/c21-13-7-17-16(24-10-25-17)6-12(13)18(20-4-3-19-8-20)11-1-2-14-15(5-11)23-9-22-14/h1-8,18,21H,9-10H2
Reactome pathway
5.60n/an/an/an/an/an/an/an/a
Universidade de Coimbra
Curated by ChEMBL
Assay Description
Inhibition of human aromatase-mediated conversion of [1beta3H]androstenedione to estrone by Lineweaver-Burk plot in presence of NADPH
J Med Chem 52: 143-50 (2009)
Article DOI: 10.1021/jm800945c
BindingDB Entry DOI: 10.7270/Q2SQ9080
Cytochrome P450 19A1
(Homo sapiens (Human))
BDBM50254016
(6-(benzo[d][1,3]dioxol-5-yl(1H-imidazol-1-yl)methy...)
Show SMILES Oc1cc2OCOc2cc1C(c1ccc2OCOc2c1)n1ccnc1
Show InChI InChI=1S/C18H14N2O5/c21-13-7-17-16(24-10-25-17)6-12(13)18(20-4-3-19-8-20)11-1-2-14-15(5-11)23-9-22-14/h1-8,18,21H,9-10H2
Reactome pathway
n/an/a 24.9n/an/an/an/an/an/a
Universidade de Coimbra
Curated by ChEMBL
Assay Description
Inhibition of human aromatase-mediated conversion of [1beta3H]androstenedione to estrone by liquid scintillation counting in presence of NADPH
J Med Chem 52: 143-50 (2009)
Article DOI: 10.1021/jm800945c
BindingDB Entry DOI: 10.7270/Q2SQ9080