BDBM50254046 (R)-N-methyl-3-(naphthalen-1-yl)-3-(thiophen-2-yl)propan-1-amine hydrochloride::CHEMBL508252
SMILES: CNCC[C@@H](c1cccs1)c1cccc2ccccc12
InChI Key: InChIKey=BAGSTHRVDRSVOR-QGZVFWFLSA-N
Data: 2 KI  1 IC50
Activity Spreadsheet -- Enzyme Inhibition Constant Data from BindingDB
Found 3 hits for monomerid = 50254046
Trg + Lig
Ki
nM
ΔG°
kcal/mole
IC50
nM
Kd
nM
EC50/IC50
nM
koff
s-1
kon
M-1s-1
pHTemp
°C
Sodium-dependent serotonin transporter
(Rattus norvegicus (rat))
BDBM50254046
((R)-N-methyl-3-(naphthalen-1-yl)-3-(thiophen-2-yl)...)
Show SMILES CNCC[C@@H](c1cccs1)c1cccc2ccccc12 |r|
Show InChI InChI=1S/C18H19NS/c1-19-12-11-17(18-10-5-13-20-18)16-9-4-7-14-6-2-3-8-15(14)16/h2-10,13,17,19H,11-12H2,1H3/t17-/m1/s1
12.1n/an/an/an/an/an/an/an/a
The State University of New York
Curated by ChEMBL
Assay Description
Displacement of [3H]citalopram from SERT in Sprague-dawley rat frontal cortex by liquid scintillation spectrophotometry
Bioorg Med Chem Lett 19: 58-61 (2008)
Article DOI: 10.1016/j.bmcl.2008.11.022
BindingDB Entry DOI: 10.7270/Q2N58N95
Transporter
(Rattus norvegicus (rat))
BDBM50254046
((R)-N-methyl-3-(naphthalen-1-yl)-3-(thiophen-2-yl)...)
Show SMILES CNCC[C@@H](c1cccs1)c1cccc2ccccc12 |r|
Show InChI InChI=1S/C18H19NS/c1-19-12-11-17(18-10-5-13-20-18)16-9-4-7-14-6-2-3-8-15(14)16/h2-10,13,17,19H,11-12H2,1H3/t17-/m1/s1
Reactome pathway
139n/an/an/an/an/an/an/an/a
The State University of New York
Curated by ChEMBL
Assay Description
Displacement of [3H]nisoxetine from Sprague-dawley rat NET by liquid scintillation spectrophotometry
Bioorg Med Chem Lett 19: 58-61 (2008)
Article DOI: 10.1016/j.bmcl.2008.11.022
BindingDB Entry DOI: 10.7270/Q2N58N95
Sodium-dependent dopamine transporter
(Rattus norvegicus (rat))
BDBM50254046
((R)-N-methyl-3-(naphthalen-1-yl)-3-(thiophen-2-yl)...)
Show SMILES CNCC[C@@H](c1cccs1)c1cccc2ccccc12 |r|
Show InChI InChI=1S/C18H19NS/c1-19-12-11-17(18-10-5-13-20-18)16-9-4-7-14-6-2-3-8-15(14)16/h2-10,13,17,19H,11-12H2,1H3/t17-/m1/s1
Reactome pathway
n/an/a 230n/an/an/an/an/an/a
The State University of New York
Curated by ChEMBL
Assay Description
Displacement of [125I]RTI55 from DAT in Sprague-dawley rat striatum by liquid scintillation spectrophotometry
Bioorg Med Chem Lett 19: 58-61 (2008)
Article DOI: 10.1016/j.bmcl.2008.11.022
BindingDB Entry DOI: 10.7270/Q2N58N95