BDBM50254133 CHEMBL4076632
SMILES: [H][C@]12CN(C3CCC4(C1)C1Cc5ccc(O)cc5C4(CCN1CC1CC1)C23)C(=O)Nc1ccccc1
InChI Key: InChIKey=SBLPBMOQBNOLRN-MPZSKYPWSA-N
Data: 3 KI  2 EC50
Activity Spreadsheet -- Enzyme Inhibition Constant Data from BindingDB
Found 5 hits for monomerid = 50254133
Trg + Lig
Ki
nM
ΔG°
kcal/mole
IC50
nM
Kd
nM
EC50/IC50
nM
koff
s-1
kon
M-1s-1
pHTemp
°C
Delta-type opioid receptor
(Homo sapiens (Human))
BDBM50254133
(CHEMBL4076632)
Show SMILES [H][C@]12CN(C3CCC4(C1)C1Cc5ccc(O)cc5C4(CCN1CC1CC1)C23)C(=O)Nc1ccccc1 |r,TLB:17:18:4.6.5:8.1,16:17:7:21.20.19,6:7:21.20.19:10.11.17,8:7:21.20.19:10.11.17,2:1:18:4.6.5,3:4:18:8.1,22:21:7:10.11.17,THB:12:11:7:21.20.19,19:18:4.6.5:8.1|
Show InChI InChI=1S/C30H35N3O2/c34-23-9-8-20-14-26-29-11-10-25-27(30(29,24(20)15-23)12-13-32(26)17-19-6-7-19)21(16-29)18-33(25)28(35)31-22-4-2-1-3-5-22/h1-5,8-9,15,19,21,25-27,34H,6-7,10-14,16-18H2,(H,31,35)/t21-,25?,26?,27?,29?,30?/m1/s1
Reactome pathway
0.265n/an/an/an/an/an/an/an/a
Nippon Chemiphar Co., Ltd
Curated by ChEMBL
Assay Description
Displacement of [3H]DPDPE from human recombinant DOR expressed in CHO cell membranes
Bioorg Med Chem Lett 27: 3495-3498 (2017)
Article DOI: 10.1016/j.bmcl.2017.05.072
BindingDB Entry DOI: 10.7270/Q25H7JPK
Kappa-type opioid receptor
(Homo sapiens (Human))
BDBM50254133
(CHEMBL4076632)
Show SMILES [H][C@]12CN(C3CCC4(C1)C1Cc5ccc(O)cc5C4(CCN1CC1CC1)C23)C(=O)Nc1ccccc1 |r,TLB:17:18:4.6.5:8.1,16:17:7:21.20.19,6:7:21.20.19:10.11.17,8:7:21.20.19:10.11.17,2:1:18:4.6.5,3:4:18:8.1,22:21:7:10.11.17,THB:12:11:7:21.20.19,19:18:4.6.5:8.1|
Show InChI InChI=1S/C30H35N3O2/c34-23-9-8-20-14-26-29-11-10-25-27(30(29,24(20)15-23)12-13-32(26)17-19-6-7-19)21(16-29)18-33(25)28(35)31-22-4-2-1-3-5-22/h1-5,8-9,15,19,21,25-27,34H,6-7,10-14,16-18H2,(H,31,35)/t21-,25?,26?,27?,29?,30?/m1/s1
Reactome pathway
0.336n/an/an/an/an/an/an/an/a
Nippon Chemiphar Co., Ltd
Curated by ChEMBL
Assay Description
Displacement of [3H]U-69,593 from human recombinant KOR expressed in CHO cell membranes
Bioorg Med Chem Lett 27: 3495-3498 (2017)
Article DOI: 10.1016/j.bmcl.2017.05.072
BindingDB Entry DOI: 10.7270/Q25H7JPK
Mu-type opioid receptor
(Homo sapiens (Human))
BDBM50254133
(CHEMBL4076632)
Show SMILES [H][C@]12CN(C3CCC4(C1)C1Cc5ccc(O)cc5C4(CCN1CC1CC1)C23)C(=O)Nc1ccccc1 |r,TLB:17:18:4.6.5:8.1,16:17:7:21.20.19,6:7:21.20.19:10.11.17,8:7:21.20.19:10.11.17,2:1:18:4.6.5,3:4:18:8.1,22:21:7:10.11.17,THB:12:11:7:21.20.19,19:18:4.6.5:8.1|
Show InChI InChI=1S/C30H35N3O2/c34-23-9-8-20-14-26-29-11-10-25-27(30(29,24(20)15-23)12-13-32(26)17-19-6-7-19)21(16-29)18-33(25)28(35)31-22-4-2-1-3-5-22/h1-5,8-9,15,19,21,25-27,34H,6-7,10-14,16-18H2,(H,31,35)/t21-,25?,26?,27?,29?,30?/m1/s1
NCI pathway
Reactome pathway
0.545n/an/an/an/an/an/an/an/a
Nippon Chemiphar Co., Ltd
Curated by ChEMBL
Assay Description
Displacement of [3H]DAMGO from human recombinant MOR expressed in CHO cell membranes
Bioorg Med Chem Lett 27: 3495-3498 (2017)
Article DOI: 10.1016/j.bmcl.2017.05.072
BindingDB Entry DOI: 10.7270/Q25H7JPK
Delta-type opioid receptor
(Homo sapiens (Human))
BDBM50254133
(CHEMBL4076632)
Show SMILES [H][C@]12CN(C3CCC4(C1)C1Cc5ccc(O)cc5C4(CCN1CC1CC1)C23)C(=O)Nc1ccccc1 |r,TLB:17:18:4.6.5:8.1,16:17:7:21.20.19,6:7:21.20.19:10.11.17,8:7:21.20.19:10.11.17,2:1:18:4.6.5,3:4:18:8.1,22:21:7:10.11.17,THB:12:11:7:21.20.19,19:18:4.6.5:8.1|
Show InChI InChI=1S/C30H35N3O2/c34-23-9-8-20-14-26-29-11-10-25-27(30(29,24(20)15-23)12-13-32(26)17-19-6-7-19)21(16-29)18-33(25)28(35)31-22-4-2-1-3-5-22/h1-5,8-9,15,19,21,25-27,34H,6-7,10-14,16-18H2,(H,31,35)/t21-,25?,26?,27?,29?,30?/m1/s1
Reactome pathway
n/an/an/an/a 1.5n/an/an/an/a
Nippon Chemiphar Co., Ltd
Curated by ChEMBL
Assay Description
Displacement of [3H]DPDPE from human recombinant DOR expressed in CHO cell membranes
Bioorg Med Chem Lett 27: 3495-3498 (2017)
Article DOI: 10.1016/j.bmcl.2017.05.072
BindingDB Entry DOI: 10.7270/Q25H7JPK
Kappa-type opioid receptor
(Homo sapiens (Human))
BDBM50254133
(CHEMBL4076632)
Show SMILES [H][C@]12CN(C3CCC4(C1)C1Cc5ccc(O)cc5C4(CCN1CC1CC1)C23)C(=O)Nc1ccccc1 |r,TLB:17:18:4.6.5:8.1,16:17:7:21.20.19,6:7:21.20.19:10.11.17,8:7:21.20.19:10.11.17,2:1:18:4.6.5,3:4:18:8.1,22:21:7:10.11.17,THB:12:11:7:21.20.19,19:18:4.6.5:8.1|
Show InChI InChI=1S/C30H35N3O2/c34-23-9-8-20-14-26-29-11-10-25-27(30(29,24(20)15-23)12-13-32(26)17-19-6-7-19)21(16-29)18-33(25)28(35)31-22-4-2-1-3-5-22/h1-5,8-9,15,19,21,25-27,34H,6-7,10-14,16-18H2,(H,31,35)/t21-,25?,26?,27?,29?,30?/m1/s1
Reactome pathway
n/an/an/an/a 0.300n/an/an/an/a
Nippon Chemiphar Co., Ltd
Curated by ChEMBL
Assay Description
Agonist activity at human recombinant KOR expressed in CHO cells assessed as cAMP accumulation
Bioorg Med Chem Lett 27: 3495-3498 (2017)
Article DOI: 10.1016/j.bmcl.2017.05.072
BindingDB Entry DOI: 10.7270/Q25H7JPK