null
SMILES: CSc1ccc(Nc2ncnc3sc(Nc4c(Cl)cccc4Cl)nc23)cc1
InChI Key: InChIKey=ZUIVRBGWSQKFOO-UHFFFAOYSA-N
Activity Spreadsheet -- Enzyme Inhibition Constant Data from BindingDB
Found 2 hits for monomerid = 50254375
Trg + Lig
Ki
nM
ΔG°
kcal/mole
IC50
nM
Kd
nM
EC50/IC50
nM
koff
s-1
kon
M-1s-1
pHTemp
°C
Transient receptor potential cation channel subfamily V member 1
(Rattus norvegicus (rat))
BDBM50254375
(CHEMBL467639 | N2-(2,6-dichlorophenyl)-N7-(4-(meth...)
Show SMILES CSc1ccc(Nc2ncnc3sc(Nc4c(Cl)cccc4Cl)nc23)cc1
Show InChI InChI=1S/C18H13Cl2N5S2/c1-26-11-7-5-10(6-8-11)23-16-15-17(22-9-21-16)27-18(25-15)24-14-12(19)3-2-4-13(14)20/h2-9H,1H3,(H,24,25)(H,21,22,23)
Reactome pathway
n/an/a 12n/an/an/an/an/an/a
Johnson & Johnson Pharmaceutical Research and Development LLC
Curated by ChEMBL
Assay Description
Antagonist activity at rat TRPV1 expressed in HEK293 cells assessed as inhibition of capsaicin-induced calcium flux
Bioorg Med Chem Lett 19: 40-6 (2008)
Article DOI: 10.1016/j.bmcl.2008.11.024
BindingDB Entry DOI: 10.7270/Q28052G3
Transient receptor potential cation channel subfamily V member 1
(Homo sapiens (Human))
BDBM50254375
(CHEMBL467639 | N2-(2,6-dichlorophenyl)-N7-(4-(meth...)
Show SMILES CSc1ccc(Nc2ncnc3sc(Nc4c(Cl)cccc4Cl)nc23)cc1
Show InChI InChI=1S/C18H13Cl2N5S2/c1-26-11-7-5-10(6-8-11)23-16-15-17(22-9-21-16)27-18(25-15)24-14-12(19)3-2-4-13(14)20/h2-9H,1H3,(H,24,25)(H,21,22,23)
Reactome pathway
n/an/a 96n/an/an/an/an/an/a
Johnson & Johnson Pharmaceutical Research and Development LLC
Curated by ChEMBL
Assay Description
Antagonist activity at human TRPV1 expressed in HEK293 cells assessed as inhibition of capsaicin-induced calcium flux
Bioorg Med Chem Lett 19: 40-6 (2008)
Article DOI: 10.1016/j.bmcl.2008.11.024
BindingDB Entry DOI: 10.7270/Q28052G3