BDBM50254677 (4-(7-butyl-9-(pyridin-2-ylsulfonyl)-3,9-diazaspiro[5.5]undecan-3-yl)-4-methylpiperidin-1-yl)(4,6-dimethylpyrimidin-5-yl)methanone::CHEMBL444255
SMILES: CCCCC1CN(CCC11CCN(CC1)C1(C)CCN(CC1)C(=O)c1c(C)ncnc1C)S(=O)(=O)c1ccccn1
InChI Key: InChIKey=QVRQWLWUNXYUTA-UHFFFAOYSA-N
Data: 1 IC50
Activity Spreadsheet -- Enzyme Inhibition Constant Data from BindingDB
Found 1 hit for monomerid = 50254677
Trg + Lig
Ki
nM
ΔG°
kcal/mole
IC50
nM
Kd
nM
EC50/IC50
nM
koff
s-1
kon
M-1s-1
pHTemp
°C
C-C chemokine receptor type 5
(Homo sapiens (Human))
BDBM50254677
((4-(7-butyl-9-(pyridin-2-ylsulfonyl)-3,9-diazaspir...)
Show SMILES CCCCC1CN(CCC11CCN(CC1)C1(C)CCN(CC1)C(=O)c1c(C)ncnc1C)S(=O)(=O)c1ccccn1
Show InChI InChI=1S/C31H46N6O3S/c1-5-6-9-26-22-37(41(39,40)27-10-7-8-16-32-27)21-15-31(26)13-19-36(20-14-31)30(4)11-17-35(18-12-30)29(38)28-24(2)33-23-34-25(28)3/h7-8,10,16,23,26H,5-6,9,11-15,17-22H2,1-4H3
n/an/a 18n/an/an/an/an/an/a
Roche Palo Alto LLC
Curated by ChEMBL
Assay Description
Antagonist activity at CCR5 receptor (unknown origin) by radiolabelled RANTES binding assay
Bioorg Med Chem Lett 19: 209-13 (2008)
Article DOI: 10.1016/j.bmcl.2008.10.115
BindingDB Entry DOI: 10.7270/Q2FQ9WGB