BDBM50254724 2-(1-(4-chlorophenyl)-2-(2,4-dichlorophenyl)-5-methyl-1H-imidazol-4-yl)-5-(pentan-2-yl)-1,3,4-thiadiazole::CHEMBL465928
SMILES: CCCC(C)c1nnc(s1)-c1nc(-c2ccc(Cl)cc2Cl)n(c1C)-c1ccc(Cl)cc1
InChI Key: InChIKey=FJFBAEKFHBDIAX-UHFFFAOYSA-N
Data: 1 IC50
Activity Spreadsheet -- Enzyme Inhibition Constant Data from BindingDB
Found 1 hit for monomerid = 50254724
Trg + Lig
Ki
nM
ΔG°
kcal/mole
IC50
nM
Kd
nM
EC50/IC50
nM
koff
s-1
kon
M-1s-1
pHTemp
°C
Cannabinoid receptor 1
(Rattus norvegicus (rat))
BDBM50254724
(2-(1-(4-chlorophenyl)-2-(2,4-dichlorophenyl)-5-met...)
Show SMILES CCCC(C)c1nnc(s1)-c1nc(-c2ccc(Cl)cc2Cl)n(c1C)-c1ccc(Cl)cc1
Show InChI InChI=1S/C23H21Cl3N4S/c1-4-5-13(2)22-28-29-23(31-22)20-14(3)30(17-9-6-15(24)7-10-17)21(27-20)18-11-8-16(25)12-19(18)26/h6-13H,4-5H2,1-3H3
Reactome pathway
n/an/a 12.7n/an/an/an/an/an/a
Green Cross Corporation
Curated by ChEMBL
Assay Description
Displacement of [3H]CP55940 from CB1 receptor in Sprague-Dawley rat cerebellar membrane
Bioorg Med Chem Lett 19: 142-5 (2008)
Article DOI: 10.1016/j.bmcl.2008.10.130
BindingDB Entry DOI: 10.7270/Q2T153H8