BDBM50254836 2-tert-butyl-5-(2-(2-chlorophenyl)-1-(4-chlorophenyl)-5-ethyl-1H-imidazol-4-yl)-1,3,4-oxadiazole::CHEMBL481388
SMILES: CCc1c(nc(-c2ccccc2Cl)n1-c1ccc(Cl)cc1)-c1nnc(o1)C(C)(C)C
InChI Key: InChIKey=OISXCSVVXWTAMR-UHFFFAOYSA-N
Data: 1 IC50
Activity Spreadsheet -- Enzyme Inhibition Constant Data from BindingDB
Found 1 hit for monomerid = 50254836
Trg + Lig
Ki
nM
ΔG°
kcal/mole
IC50
nM
Kd
nM
EC50/IC50
nM
koff
s-1
kon
M-1s-1
pHTemp
°C
Cannabinoid receptor 1
(Rattus norvegicus (rat))
BDBM50254836
(2-tert-butyl-5-(2-(2-chlorophenyl)-1-(4-chlorophen...)
Show SMILES CCc1c(nc(-c2ccccc2Cl)n1-c1ccc(Cl)cc1)-c1nnc(o1)C(C)(C)C
Show InChI InChI=1S/C23H22Cl2N4O/c1-5-18-19(21-27-28-22(30-21)23(2,3)4)26-20(16-8-6-7-9-17(16)25)29(18)15-12-10-14(24)11-13-15/h6-13H,5H2,1-4H3
Reactome pathway
n/an/a 21.3n/an/an/an/an/an/a
Green Cross Corporation
Curated by ChEMBL
Assay Description
Displacement of [3H]CP55940 from CB1 receptor in Sprague-Dawley rat cerebellar membrane
Bioorg Med Chem Lett 19: 142-5 (2008)
Article DOI: 10.1016/j.bmcl.2008.10.130
BindingDB Entry DOI: 10.7270/Q2T153H8