BDBM50254879 2-tert-butyl-5-(1-(4-chlorophenyl)-5-cyclopropyl-2-(2,4-dichlorophenyl)-1H-imidazol-4-yl)-1,3,4-thiadiazole::CHEMBL480410
SMILES: CC(C)(C)c1nnc(s1)-c1nc(-c2ccc(Cl)cc2Cl)n(c1C1CC1)-c1ccc(Cl)cc1
InChI Key: InChIKey=XJSXNMALSIWDDC-UHFFFAOYSA-N
Data: 1 IC50
Activity Spreadsheet -- Enzyme Inhibition Constant Data from BindingDB
Found 1 hit for monomerid = 50254879
Trg + Lig
Ki
nM
ΔG°
kcal/mole
IC50
nM
Kd
nM
EC50/IC50
nM
koff
s-1
kon
M-1s-1
pHTemp
°C
Cannabinoid receptor 1
(Rattus norvegicus (rat))
BDBM50254879
(2-tert-butyl-5-(1-(4-chlorophenyl)-5-cyclopropyl-2...)
Show SMILES CC(C)(C)c1nnc(s1)-c1nc(-c2ccc(Cl)cc2Cl)n(c1C1CC1)-c1ccc(Cl)cc1
Show InChI InChI=1S/C24H21Cl3N4S/c1-24(2,3)23-30-29-22(32-23)19-20(13-4-5-13)31(16-9-6-14(25)7-10-16)21(28-19)17-11-8-15(26)12-18(17)27/h6-13H,4-5H2,1-3H3
Reactome pathway
n/an/a 58n/an/an/an/an/an/a
Green Cross Corporation
Curated by ChEMBL
Assay Description
Displacement of [3H]CP55940 from CB1 receptor in Sprague-Dawley rat cerebellar membrane
Bioorg Med Chem Lett 19: 142-5 (2008)
Article DOI: 10.1016/j.bmcl.2008.10.130
BindingDB Entry DOI: 10.7270/Q2T153H8