BDBM50254992 2-(1-(4-bromophenyl)-2-(2,4-dichlorophenyl)-5-ethyl-1H-imidazol-4-yl)-5-(1-(4-chlorophenyl)cyclopropyl)-1,3,4-oxadiazole::CHEMBL464084
SMILES: CCc1c(nc(-c2ccc(Cl)cc2Cl)n1-c1ccc(Br)cc1)-c1nnc(o1)C1(CC1)c1ccc(Cl)cc1
InChI Key: InChIKey=IRXGZROGZDKFLC-UHFFFAOYSA-N
Data: 1 IC50
Activity Spreadsheet -- Enzyme Inhibition Constant Data from BindingDB
Found 1 hit for monomerid = 50254992
Trg + Lig
Ki
nM
ΔG°
kcal/mole
IC50
nM
Kd
nM
EC50/IC50
nM
koff
s-1
kon
M-1s-1
pHTemp
°C
Cannabinoid receptor 1
(Rattus norvegicus (rat))
BDBM50254992
(2-(1-(4-bromophenyl)-2-(2,4-dichlorophenyl)-5-ethy...)
Show SMILES CCc1c(nc(-c2ccc(Cl)cc2Cl)n1-c1ccc(Br)cc1)-c1nnc(o1)C1(CC1)c1ccc(Cl)cc1
Show InChI InChI=1S/C28H20BrCl3N4O/c1-2-23-24(26-34-35-27(37-26)28(13-14-28)16-3-7-18(30)8-4-16)33-25(21-12-9-19(31)15-22(21)32)36(23)20-10-5-17(29)6-11-20/h3-12,15H,2,13-14H2,1H3
Reactome pathway
n/an/a 9.05n/an/an/an/an/an/a
Green Cross Corporation
Curated by ChEMBL
Assay Description
Displacement of [3H]CP55940 from CB1 receptor in Sprague-Dawley rat cerebellar membrane
Bioorg Med Chem Lett 19: 142-5 (2008)
Article DOI: 10.1016/j.bmcl.2008.10.130
BindingDB Entry DOI: 10.7270/Q2T153H8