BDBM50255057 2-(1-(4-bromophenyl)-2-(2,4-dichlorophenyl)-5-ethyl-1H-imidazol-4-yl)-5-(1-(4-chlorophenyl)cyclobutyl)-1,3,4-thiadiazole::CHEMBL520121
SMILES: CCc1c(nc(-c2ccc(Cl)cc2Cl)n1-c1ccc(Br)cc1)-c1nnc(s1)C1(CCC1)c1ccc(Cl)cc1
InChI Key: InChIKey=UABDAIKUCCIYTH-UHFFFAOYSA-N
Data: 2 IC50
Activity Spreadsheet -- Enzyme Inhibition Constant Data from BindingDB
Found 2 hits for monomerid = 50255057
Trg + Lig
Ki
nM
ΔG°
kcal/mole
IC50
nM
Kd
nM
EC50/IC50
nM
koff
s-1
kon
M-1s-1
pHTemp
°C
Cannabinoid receptor 2
(Homo sapiens (Human))
BDBM50255057
(2-(1-(4-bromophenyl)-2-(2,4-dichlorophenyl)-5-ethy...)
Show SMILES CCc1c(nc(-c2ccc(Cl)cc2Cl)n1-c1ccc(Br)cc1)-c1nnc(s1)C1(CCC1)c1ccc(Cl)cc1
Show InChI InChI=1S/C29H22BrCl3N4S/c1-2-24-25(27-35-36-28(38-27)29(14-3-15-29)17-4-8-19(31)9-5-17)34-26(22-13-10-20(32)16-23(22)33)37(24)21-11-6-18(30)7-12-21/h4-13,16H,2-3,14-15H2,1H3
Reactome pathway
n/an/a>1.00E+4n/an/an/an/an/an/a
Green Cross Corporation
Curated by ChEMBL
Assay Description
Displacement of [3H]WIN-55212-2 from human CB2 receptor expressed in CHO cells
Bioorg Med Chem Lett 19: 142-5 (2008)
Article DOI: 10.1016/j.bmcl.2008.10.130
BindingDB Entry DOI: 10.7270/Q2T153H8
Cannabinoid receptor 1
(Rattus norvegicus (rat))
BDBM50255057
(2-(1-(4-bromophenyl)-2-(2,4-dichlorophenyl)-5-ethy...)
Show SMILES CCc1c(nc(-c2ccc(Cl)cc2Cl)n1-c1ccc(Br)cc1)-c1nnc(s1)C1(CCC1)c1ccc(Cl)cc1
Show InChI InChI=1S/C29H22BrCl3N4S/c1-2-24-25(27-35-36-28(38-27)29(14-3-15-29)17-4-8-19(31)9-5-17)34-26(22-13-10-20(32)16-23(22)33)37(24)21-11-6-18(30)7-12-21/h4-13,16H,2-3,14-15H2,1H3
Reactome pathway
n/an/a 4.79n/an/an/an/an/an/a
Green Cross Corporation
Curated by ChEMBL
Assay Description
Displacement of [3H]CP55940 from CB1 receptor in Sprague-Dawley rat cerebellar membrane
Bioorg Med Chem Lett 19: 142-5 (2008)
Article DOI: 10.1016/j.bmcl.2008.10.130
BindingDB Entry DOI: 10.7270/Q2T153H8