BDBM50255068 (S)-N-(2'-oxo-1,1',2',3-tetrahydrospiro[indene-2,3'-pyrrolo[2,3-b]pyridine]-5-yl)-2-(2-oxo-2',3',5',6'-tetrahydrospiro[indoline-3,4'-pyran]-1-yl)acetamide::CHEMBL464079
SMILES: O=C(CN1C(=O)C2(CCOCC2)c2ccccc12)Nc1ccc2C[C@@]3(Cc2c1)C(=O)Nc1ncccc31
InChI Key: InChIKey=HGRHCVKYWPUJJT-LJAQVGFWSA-N
Data: 1 KI  2 IC50
Activity Spreadsheet -- Enzyme Inhibition Constant Data from BindingDB
Found 3 hits for monomerid = 50255068
Trg + Lig
Ki
nM
ΔG°
kcal/mole
IC50
nM
Kd
nM
EC50/IC50
nM
koff
s-1
kon
M-1s-1
pHTemp
°C
Calcitonin gene-related peptide type 1 receptor
(Homo sapiens (Human))
BDBM50255068
((S)-N-(2'-oxo-1,1',2',3-tetrahydrospiro[indene-2,3...)
Show SMILES O=C(CN1C(=O)C2(CCOCC2)c2ccccc12)Nc1ccc2C[C@@]3(Cc2c1)C(=O)Nc1ncccc31 |r|
Show InChI InChI=1S/C29H26N4O4/c34-24(17-33-23-6-2-1-4-21(23)28(27(33)36)9-12-37-13-10-28)31-20-8-7-18-15-29(16-19(18)14-20)22-5-3-11-30-25(22)32-26(29)35/h1-8,11,14H,9-10,12-13,15-17H2,(H,31,34)(H,30,32,35)/t29-/m0/s1
Reactome pathway
1.70n/an/an/an/an/an/an/an/a
Merck& Co
Curated by ChEMBL
Assay Description
Displacement of [125I]hCGRP from human CGRP receptor expressed in HEK293 cells coexpressing RAMP1
Bioorg Med Chem Lett 19: 214-7 (2008)
Article DOI: 10.1016/j.bmcl.2008.10.106
BindingDB Entry DOI: 10.7270/Q21C1XSK
Calcitonin gene-related peptide type 1 receptor
(Homo sapiens (Human))
BDBM50255068
((S)-N-(2'-oxo-1,1',2',3-tetrahydrospiro[indene-2,3...)
Show SMILES O=C(CN1C(=O)C2(CCOCC2)c2ccccc12)Nc1ccc2C[C@@]3(Cc2c1)C(=O)Nc1ncccc31 |r|
Show InChI InChI=1S/C29H26N4O4/c34-24(17-33-23-6-2-1-4-21(23)28(27(33)36)9-12-37-13-10-28)31-20-8-7-18-15-29(16-19(18)14-20)22-5-3-11-30-25(22)32-26(29)35/h1-8,11,14H,9-10,12-13,15-17H2,(H,31,34)(H,30,32,35)/t29-/m0/s1
Reactome pathway
n/an/a 39n/an/an/an/an/an/a
Merck& Co
Curated by ChEMBL
Assay Description
Antagonistic activity at human CGRP receptor expressed in HEK293 cells coexpressing RAMP1 assessed as inhibition of CGRP-induced cAMP production in p...
Bioorg Med Chem Lett 19: 214-7 (2008)
Article DOI: 10.1016/j.bmcl.2008.10.106
BindingDB Entry DOI: 10.7270/Q21C1XSK
Calcitonin gene-related peptide type 1 receptor
(Homo sapiens (Human))
BDBM50255068
((S)-N-(2'-oxo-1,1',2',3-tetrahydrospiro[indene-2,3...)
Show SMILES O=C(CN1C(=O)C2(CCOCC2)c2ccccc12)Nc1ccc2C[C@@]3(Cc2c1)C(=O)Nc1ncccc31 |r|
Show InChI InChI=1S/C29H26N4O4/c34-24(17-33-23-6-2-1-4-21(23)28(27(33)36)9-12-37-13-10-28)31-20-8-7-18-15-29(16-19(18)14-20)22-5-3-11-30-25(22)32-26(29)35/h1-8,11,14H,9-10,12-13,15-17H2,(H,31,34)(H,30,32,35)/t29-/m0/s1
Reactome pathway
n/an/a 5.70n/an/an/an/an/an/a
Merck& Co
Curated by ChEMBL
Assay Description
Antagonistic activity at human CGRP receptor expressed in HEK293 cells coexpressing RAMP1 assessed as inhibition of CGRP-induced cAMP production
Bioorg Med Chem Lett 19: 214-7 (2008)
Article DOI: 10.1016/j.bmcl.2008.10.106
BindingDB Entry DOI: 10.7270/Q21C1XSK