null
SMILES: NC(=O)c1cnc(N[C@H]2CCCNC2)c2cc(sc12)-c1cnn(Cc2ccccc2)c1
InChI Key: InChIKey=GELAGPPHKOHLGO-KRWDZBQOSA-N
Activity Spreadsheet -- Enzyme Inhibition Constant Data from BindingDB
Found 2 hits for monomerid = 50255165
Trg + Lig
Ki
nM
ΔG°
kcal/mole
IC50
nM
Kd
nM
EC50/IC50
nM
koff
s-1
kon
M-1s-1
pHTemp
°C
Serine/threonine-protein kinase Chk1
(Homo sapiens (Human))
BDBM50255165
(CHEMBL4071952)
Show SMILES NC(=O)c1cnc(N[C@H]2CCCNC2)c2cc(sc12)-c1cnn(Cc2ccccc2)c1 |r|
Show InChI InChI=1S/C23H24N6OS/c24-22(30)19-12-26-23(28-17-7-4-8-25-11-17)18-9-20(31-21(18)19)16-10-27-29(14-16)13-15-5-2-1-3-6-15/h1-3,5-6,9-10,12,14,17,25H,4,7-8,11,13H2,(H2,24,30)(H,26,28)/t17-/m0/s1
Reactome pathway
n/an/a 14n/an/an/an/an/an/a
Oncology Chemistry, IMED Biotech Unit, AstraZeneca , 35 Gatehouse Drive, Waltham, Massachusetts 02451, United States.
Curated by ChEMBL
Assay Description
Inhibition of CHK1 (unknown origin)
J Med Chem 61: 1061-1073 (2018)
Article DOI: 10.1021/acs.jmedchem.7b01490
BindingDB Entry DOI: 10.7270/Q2PC34T5
Serine/threonine-protein kinase Chk1
(Homo sapiens (Human))
BDBM50255165
(CHEMBL4071952)
Show SMILES NC(=O)c1cnc(N[C@H]2CCCNC2)c2cc(sc12)-c1cnn(Cc2ccccc2)c1 |r|
Show InChI InChI=1S/C23H24N6OS/c24-22(30)19-12-26-23(28-17-7-4-8-25-11-17)18-9-20(31-21(18)19)16-10-27-29(14-16)13-15-5-2-1-3-6-15/h1-3,5-6,9-10,12,14,17,25H,4,7-8,11,13H2,(H2,24,30)(H,26,28)/t17-/m0/s1
Reactome pathway
n/an/an/an/a 60n/an/an/an/a
Oncology Chemistry, IMED Biotech Unit, AstraZeneca , 35 Gatehouse Drive, Waltham, Massachusetts 02451, United States.
Curated by ChEMBL
Assay Description
Inhibition of CHK1 in human HT29 cells assessed as abrogation of camptothecin-induced G2/M phase arrest
J Med Chem 61: 1061-1073 (2018)
Article DOI: 10.1021/acs.jmedchem.7b01490
BindingDB Entry DOI: 10.7270/Q2PC34T5