BDBM50255520 4-(2,4-difluorophenylamino)-7-methoxy-6-(4-methylpiperazin-1-yl)quinoline-3-carboxamide::CHEMBL480445
SMILES: COc1cc2ncc(C(N)=O)c(Nc3ccc(F)cc3F)c2cc1N1CCN(C)CC1
InChI Key: InChIKey=ZJODRBGRKHPTDB-UHFFFAOYSA-N
Data: 1 IC50
Activity Spreadsheet -- Enzyme Inhibition Constant Data from BindingDB
Found 1 hit for monomerid = 50255520
Trg + Lig
Ki
nM
ΔG°
kcal/mole
IC50
nM
Kd
nM
EC50/IC50
nM
koff
s-1
kon
M-1s-1
pHTemp
°C
Macrophage colony stimulating factor receptor
(Homo sapiens (Human))
BDBM50255520
(4-(2,4-difluorophenylamino)-7-methoxy-6-(4-methylp...)
Show SMILES COc1cc2ncc(C(N)=O)c(Nc3ccc(F)cc3F)c2cc1N1CCN(C)CC1
Show InChI InChI=1S/C22H23F2N5O2/c1-28-5-7-29(8-6-28)19-10-14-18(11-20(19)31-2)26-12-15(22(25)30)21(14)27-17-4-3-13(23)9-16(17)24/h3-4,9-12H,5-8H2,1-2H3,(H2,25,30)(H,26,27)
n/an/a 6n/an/an/an/an/an/a
AstraZeneca R&D Boston
Curated by ChEMBL
Assay Description
Inhibition of CSF1R (unknown origin)
Bioorg Med Chem Lett 19: 701-5 (2009)
Article DOI: 10.1016/j.bmcl.2008.12.044
BindingDB Entry DOI: 10.7270/Q2JW8DSV