null
SMILES: NC1=NC(C(=O)N1)=C1CCNC(=O)c2[nH]c3c(Br)csc3c12
InChI Key: InChIKey=SIDVKOFTVXLYIV-UHFFFAOYSA-N
Activity Spreadsheet -- Enzyme Inhibition Constant Data from BindingDB
Found 1 hit for monomerid = 50256003
Trg + Lig
Ki
nM
ΔG°
kcal/mole
IC50
nM
Kd
nM
EC50/IC50
nM
koff
s-1
kon
M-1s-1
pHTemp
°C
Serine/threonine-protein kinase Chk1
(Homo sapiens (Human))
BDBM50256003
(4-[2-Amino-5-oxo-3,5-dihydro-imidazol-(4)-ylidene]...)
Show SMILES NC1=NC(C(=O)N1)=C1CCNC(=O)c2[nH]c3c(Br)csc3c12 |w:3.2,t:1|
Show InChI InChI=1S/C13H10BrN5O2S/c14-5-3-22-10-6-4(7-12(21)19-13(15)18-7)1-2-16-11(20)9(6)17-8(5)10/h3,17H,1-2H2,(H,16,20)(H3,15,18,19,21)
Reactome pathway
n/an/a 14n/an/an/an/an/an/a
Institut de Recherche Servier
Curated by ChEMBL
Assay Description
Inhibition of CHK1
Bioorg Med Chem Lett 19: 841-4 (2009)
Article DOI: 10.1016/j.bmcl.2008.12.001
BindingDB Entry DOI: 10.7270/Q2QN66MH