BDBM50256018 CHEMBL473427::N-(3-chloro-4-(3-fluorobenzyloxy)phenyl)-6-(thiophen-2-yl)thieno[3,2-d]pyrimidin-4-amine
SMILES: Fc1cccc(COc2ccc(Nc3ncnc4cc(sc34)-c3cccs3)cc2Cl)c1
InChI Key: InChIKey=FMSVVUDMNOXYTG-UHFFFAOYSA-N
Data: 2 IC50
Activity Spreadsheet -- Enzyme Inhibition Constant Data from BindingDB
Found 2 hits for monomerid = 50256018
Trg + Lig
Ki
nM
ΔG°
kcal/mole
IC50
nM
Kd
nM
EC50/IC50
nM
koff
s-1
kon
M-1s-1
pHTemp
°C
Epidermal growth factor receptor
(Homo sapiens (Human))
BDBM50256018
(CHEMBL473427 | N-(3-chloro-4-(3-fluorobenzyloxy)ph...)
Show SMILES Fc1cccc(COc2ccc(Nc3ncnc4cc(sc34)-c3cccs3)cc2Cl)c1
Show InChI InChI=1S/C23H15ClFN3OS2/c24-17-10-16(6-7-19(17)29-12-14-3-1-4-15(25)9-14)28-23-22-18(26-13-27-23)11-21(31-22)20-5-2-8-30-20/h1-11,13H,12H2,(H,26,27,28)
n/an/a 8n/an/an/an/an/an/a
GlaxoSmithKline
Curated by ChEMBL
Assay Description
Inhibition of EGFR
Bioorg Med Chem Lett 19: 817-20 (2009)
Article DOI: 10.1016/j.bmcl.2008.12.011
BindingDB Entry DOI: 10.7270/Q2TH8NNN
Receptor tyrosine-protein kinase erbB-2
(Homo sapiens (Human))
BDBM50256018
(CHEMBL473427 | N-(3-chloro-4-(3-fluorobenzyloxy)ph...)
Show SMILES Fc1cccc(COc2ccc(Nc3ncnc4cc(sc34)-c3cccs3)cc2Cl)c1
Show InChI InChI=1S/C23H15ClFN3OS2/c24-17-10-16(6-7-19(17)29-12-14-3-1-4-15(25)9-14)28-23-22-18(26-13-27-23)11-21(31-22)20-5-2-8-30-20/h1-11,13H,12H2,(H,26,27,28)
n/an/a 113n/an/an/an/an/an/a
GlaxoSmithKline
Curated by ChEMBL
Assay Description
Inhibition of ErbB2
Bioorg Med Chem Lett 19: 817-20 (2009)
Article DOI: 10.1016/j.bmcl.2008.12.011
BindingDB Entry DOI: 10.7270/Q2TH8NNN