BDBM50256411 2,6-difluoro-N-(3-(3-(2-(3-(pyrrolidin-1-ylmethyl)phenylamino)pyrimidin-4-yl)imidazo[1,2-a]pyridin-2-yl)phenyl)benzamide::CHEMBL504398
SMILES: Fc1cccc(F)c1C(=O)Nc1cccc(c1)-c1nc2ccccn2c1-c1ccnc(Nc2cccc(CN3CCCC3)c2)n1
InChI Key: InChIKey=XYQKWUPJOALDBD-UHFFFAOYSA-N
Data: 2 IC50
Activity Spreadsheet -- Enzyme Inhibition Constant Data from BindingDB
Found 2 hits for monomerid = 50256411
Trg + Lig
Ki
nM
ΔG°
kcal/mole
IC50
nM
Kd
nM
EC50/IC50
nM
koff
s-1
kon
M-1s-1
pHTemp
°C
Insulin-like growth factor I receptor
(Homo sapiens (Human))
BDBM50256411
(2,6-difluoro-N-(3-(3-(2-(3-(pyrrolidin-1-ylmethyl)...)
Show SMILES Fc1cccc(F)c1C(=O)Nc1cccc(c1)-c1nc2ccccn2c1-c1ccnc(Nc2cccc(CN3CCCC3)c2)n1
Show InChI InChI=1S/C35H29F2N7O/c36-27-12-7-13-28(37)31(27)34(45)39-26-11-6-9-24(21-26)32-33(44-19-2-1-14-30(44)42-32)29-15-16-38-35(41-29)40-25-10-5-8-23(20-25)22-43-17-3-4-18-43/h1-2,5-16,19-21H,3-4,17-18,22H2,(H,39,45)(H,38,40,41)
Reactome pathway
n/an/a 180n/an/an/an/an/an/a
GlaxoSmithKline
Curated by ChEMBL
Assay Description
Inhibition of human IGF1R autophosphorylation in transfected mouse NIH3T3 cells
Bioorg Med Chem Lett 19: 1004-8 (2009)
Article DOI: 10.1016/j.bmcl.2008.11.058
BindingDB Entry DOI: 10.7270/Q24T6J8M
Insulin-like growth factor I receptor
(Homo sapiens (Human))
BDBM50256411
(2,6-difluoro-N-(3-(3-(2-(3-(pyrrolidin-1-ylmethyl)...)
Show SMILES Fc1cccc(F)c1C(=O)Nc1cccc(c1)-c1nc2ccccn2c1-c1ccnc(Nc2cccc(CN3CCCC3)c2)n1
Show InChI InChI=1S/C35H29F2N7O/c36-27-12-7-13-28(37)31(27)34(45)39-26-11-6-9-24(21-26)32-33(44-19-2-1-14-30(44)42-32)29-15-16-38-35(41-29)40-25-10-5-8-23(20-25)22-43-17-3-4-18-43/h1-2,5-16,19-21H,3-4,17-18,22H2,(H,39,45)(H,38,40,41)
Reactome pathway
n/an/a 5.93E+3n/an/an/an/an/an/a
GlaxoSmithKline
Curated by ChEMBL
Assay Description
Inhibition of human IGF1R autophosphorylation in transfected mouse NIH3T3 cells
Bioorg Med Chem Lett 19: 1004-8 (2009)
Article DOI: 10.1016/j.bmcl.2008.11.058
BindingDB Entry DOI: 10.7270/Q24T6J8M