null
SMILES: Fc1cccc(F)c1NC(=O)c1cccc(c1)-c1nc2ccccn2c1-c1ccnc(Nc2ccc(cc2)N2CCC(CC2)N2CCCCC2)n1
InChI Key: InChIKey=NVKNRLYOPWKSFW-UHFFFAOYSA-N
Activity Spreadsheet -- Enzyme Inhibition Constant Data from BindingDB
Found 3 hits for monomerid = 50256470
Trg + Lig
Ki
nM
ΔG°
kcal/mole
IC50
nM
Kd
nM
EC50/IC50
nM
koff
s-1
kon
M-1s-1
pHTemp
°C
Insulin-like growth factor 1 receptor
(Homo sapiens (Human))
BDBM50256470
(3-(3-(2-(4-(1,4'-bipiperidin-1'-yl)phenylamino)pyr...)
Show SMILES Fc1cccc(F)c1NC(=O)c1cccc(c1)-c1nc2ccccn2c1-c1ccnc(Nc2ccc(cc2)N2CCC(CC2)N2CCCCC2)n1
Show InChI InChI=1S/C40H38F2N8O/c41-32-10-7-11-33(42)37(32)47-39(51)28-9-6-8-27(26-28)36-38(50-23-5-2-12-35(50)46-36)34-17-20-43-40(45-34)44-29-13-15-30(16-14-29)49-24-18-31(19-25-49)48-21-3-1-4-22-48/h2,5-17,20,23,26,31H,1,3-4,18-19,21-22,24-25H2,(H,47,51)(H,43,44,45)
Reactome pathway
n/an/a 2n/an/an/an/an/an/a
GlaxoSmithKline
Curated by ChEMBL
Assay Description
Inhibition of GST-tagged IGF1R (957-1367) (unknown origin) expressed in baculovirus by time-resolved fluorescence assay
Bioorg Med Chem Lett 19: 1004-8 (2009)
Article DOI: 10.1016/j.bmcl.2008.11.058
BindingDB Entry DOI: 10.7270/Q24T6J8M
Insulin-like growth factor 1 receptor
(Homo sapiens (Human))
BDBM50256470
(3-(3-(2-(4-(1,4'-bipiperidin-1'-yl)phenylamino)pyr...)
Show SMILES Fc1cccc(F)c1NC(=O)c1cccc(c1)-c1nc2ccccn2c1-c1ccnc(Nc2ccc(cc2)N2CCC(CC2)N2CCCCC2)n1
Show InChI InChI=1S/C40H38F2N8O/c41-32-10-7-11-33(42)37(32)47-39(51)28-9-6-8-27(26-28)36-38(50-23-5-2-12-35(50)46-36)34-17-20-43-40(45-34)44-29-13-15-30(16-14-29)49-24-18-31(19-25-49)48-21-3-1-4-22-48/h2,5-17,20,23,26,31H,1,3-4,18-19,21-22,24-25H2,(H,47,51)(H,43,44,45)
Reactome pathway
n/an/a 87n/an/an/an/an/an/a
GlaxoSmithKline
Curated by ChEMBL
Assay Description
Inhibition of human IGF1R autophosphorylation in transfected mouse NIH3T3 cells
Bioorg Med Chem Lett 19: 1004-8 (2009)
Article DOI: 10.1016/j.bmcl.2008.11.058
BindingDB Entry DOI: 10.7270/Q24T6J8M
Mitogen-activated protein kinase 14
(Homo sapiens (Human))
BDBM50256470
(3-(3-(2-(4-(1,4'-bipiperidin-1'-yl)phenylamino)pyr...)
Show SMILES Fc1cccc(F)c1NC(=O)c1cccc(c1)-c1nc2ccccn2c1-c1ccnc(Nc2ccc(cc2)N2CCC(CC2)N2CCCCC2)n1
Show InChI InChI=1S/C40H38F2N8O/c41-32-10-7-11-33(42)37(32)47-39(51)28-9-6-8-27(26-28)36-38(50-23-5-2-12-35(50)46-36)34-17-20-43-40(45-34)44-29-13-15-30(16-14-29)49-24-18-31(19-25-49)48-21-3-1-4-22-48/h2,5-17,20,23,26,31H,1,3-4,18-19,21-22,24-25H2,(H,47,51)(H,43,44,45)
NCI pathway
Reactome pathway
n/an/a 9n/an/an/an/an/an/a
GlaxoSmithKline
Curated by ChEMBL
Assay Description
Inhibition of p38alpha
Bioorg Med Chem Lett 19: 1004-8 (2009)
Article DOI: 10.1016/j.bmcl.2008.11.058
BindingDB Entry DOI: 10.7270/Q24T6J8M