BDBM50257045 CHEMBL4095685
SMILES: Cc1cc(Oc2cncnc2)cc(n1)C(=O)Nc1cccc(F)n1
InChI Key: InChIKey=TWJCQHMUHQCNGD-UHFFFAOYSA-N
Data: 6 IC50
Activity Spreadsheet -- Enzyme Inhibition Constant Data from BindingDB
Found 6 hits for monomerid = 50257045
Trg + Lig
Ki
nM
ΔG°
kcal/mole
IC50
nM
Kd
nM
EC50/IC50
nM
koff
s-1
kon
M-1s-1
pHTemp
°C
Cytochrome P450 3A4
(Homo sapiens (Human))
BDBM50257045
(CHEMBL4095685)
Show SMILES Cc1cc(Oc2cncnc2)cc(n1)C(=O)Nc1cccc(F)n1
Show InChI InChI=1S/C16H12FN5O2/c1-10-5-11(24-12-7-18-9-19-8-12)6-13(20-10)16(23)22-15-4-2-3-14(17)21-15/h2-9H,1H3,(H,21,22,23)
Reactome pathway
n/an/a>3.00E+4n/an/an/an/an/an/a
Department of Radiology and Radiological Sciences, Vanderbilt University Institute of Imaging Science, Vanderbilt University Medical Center , Nashville, Tennessee 37232, United States.
Curated by ChEMBL
Assay Description
Inhibition of CYP3A4 in human liver microsomes using midazolam as substrate preincubated for 5 mins followed by NADPH addition measured after 8 mins ...
J Med Chem 60: 5072-5085 (2017)
Article DOI: 10.1021/acs.jmedchem.7b00410
BindingDB Entry DOI: 10.7270/Q2JH3PM7
Cytochrome P450 2D6
(Homo sapiens (Human))
BDBM50257045
(CHEMBL4095685)
Show SMILES Cc1cc(Oc2cncnc2)cc(n1)C(=O)Nc1cccc(F)n1
Show InChI InChI=1S/C16H12FN5O2/c1-10-5-11(24-12-7-18-9-19-8-12)6-13(20-10)16(23)22-15-4-2-3-14(17)21-15/h2-9H,1H3,(H,21,22,23)
n/an/a>3.00E+4n/an/an/an/an/an/a
Department of Radiology and Radiological Sciences, Vanderbilt University Institute of Imaging Science, Vanderbilt University Medical Center , Nashville, Tennessee 37232, United States.
Curated by ChEMBL
Assay Description
Inhibition of CYP2D6 in human liver microsomes using (R)-bufuralol as substrate preincubated for 15 mins measured after 8 mins in presence or absence...
J Med Chem 60: 5072-5085 (2017)
Article DOI: 10.1021/acs.jmedchem.7b00410
BindingDB Entry DOI: 10.7270/Q2JH3PM7
Metabotropic glutamate receptor
(Rattus norvegicus (Rat))
BDBM50257045
(CHEMBL4095685)
Show SMILES Cc1cc(Oc2cncnc2)cc(n1)C(=O)Nc1cccc(F)n1
Show InChI InChI=1S/C16H12FN5O2/c1-10-5-11(24-12-7-18-9-19-8-12)6-13(20-10)16(23)22-15-4-2-3-14(17)21-15/h2-9H,1H3,(H,21,22,23)
Reactome pathway
n/an/a 11n/an/an/an/an/an/a
Department of Radiology and Radiological Sciences, Vanderbilt University Institute of Imaging Science, Vanderbilt University Medical Center , Nashville, Tennessee 37232, United States.
Curated by ChEMBL
Assay Description
Negative allosteric modulation of rat mGlu5 receptor expressed in HEK293A cells assessed as inhibition of glutamate induced-calcium mobilization prei...
J Med Chem 60: 5072-5085 (2017)
Article DOI: 10.1021/acs.jmedchem.7b00410
BindingDB Entry DOI: 10.7270/Q2JH3PM7
Cytochrome P450 1A
(Homo sapiens (Human))
BDBM50257045
(CHEMBL4095685)
Show SMILES Cc1cc(Oc2cncnc2)cc(n1)C(=O)Nc1cccc(F)n1
Show InChI InChI=1S/C16H12FN5O2/c1-10-5-11(24-12-7-18-9-19-8-12)6-13(20-10)16(23)22-15-4-2-3-14(17)21-15/h2-9H,1H3,(H,21,22,23)
Reactome pathway
n/an/a 600n/an/an/an/an/an/a
Department of Radiology and Radiological Sciences, Vanderbilt University Institute of Imaging Science, Vanderbilt University Medical Center , Nashville, Tennessee 37232, United States.
Curated by ChEMBL
Assay Description
Inhibition of CYP1A2 in human liver microsomes using tacrine as substrate preincubated for 5 mins followed by NADPH addition measured after 8 mins by...
J Med Chem 60: 5072-5085 (2017)
Article DOI: 10.1021/acs.jmedchem.7b00410
BindingDB Entry DOI: 10.7270/Q2JH3PM7
Metabotropic glutamate receptor
(Rattus norvegicus (Rat))
BDBM50257045
(CHEMBL4095685)
Show SMILES Cc1cc(Oc2cncnc2)cc(n1)C(=O)Nc1cccc(F)n1
Show InChI InChI=1S/C16H12FN5O2/c1-10-5-11(24-12-7-18-9-19-8-12)6-13(20-10)16(23)22-15-4-2-3-14(17)21-15/h2-9H,1H3,(H,21,22,23)
Reactome pathway
n/an/a 11n/an/an/an/an/an/a
Department of Radiology and Radiological Sciences, Vanderbilt University Institute of Imaging Science, Vanderbilt University Medical Center , Nashville, Tennessee 37232, United States.
Curated by ChEMBL
Assay Description
Negative allosteric modulation of rat mGlu5 receptor expressed in HEK293A cells assessed as inhibition of glutamate induced-calcium mobilization prei...
J Med Chem 60: 5072-5085 (2017)
Article DOI: 10.1021/acs.jmedchem.7b00410
BindingDB Entry DOI: 10.7270/Q2JH3PM7
Cytochrome P450 2C9
(Homo sapiens (Human))
BDBM50257045
(CHEMBL4095685)
Show SMILES Cc1cc(Oc2cncnc2)cc(n1)C(=O)Nc1cccc(F)n1
Show InChI InChI=1S/C16H12FN5O2/c1-10-5-11(24-12-7-18-9-19-8-12)6-13(20-10)16(23)22-15-4-2-3-14(17)21-15/h2-9H,1H3,(H,21,22,23)
Reactome pathway
n/an/a 1.80E+3n/an/an/an/an/an/a
Department of Radiology and Radiological Sciences, Vanderbilt University Institute of Imaging Science, Vanderbilt University Medical Center , Nashville, Tennessee 37232, United States.
Curated by ChEMBL
Assay Description
Inhibition of CYP2C9 in human liver microsomes using diclofenac as substrate preincubated for 5 mins followed by NADPH addition measured after 8 mins...
J Med Chem 60: 5072-5085 (2017)
Article DOI: 10.1021/acs.jmedchem.7b00410
BindingDB Entry DOI: 10.7270/Q2JH3PM7