BDBM50257176 CHEMBL2324396
SMILES: Fc1cc(Oc2ccc(cc2-c2ccnnc2)C(F)(F)F)c(Cl)cc1S(=O)(=O)Nc1cscn1
InChI Key: InChIKey=BZHXHYQSHOIRAH-UHFFFAOYSA-N
Data: 5 IC50
Activity Spreadsheet -- Enzyme Inhibition Constant Data from BindingDB
Found 5 hits for monomerid = 50257176
Trg + Lig
Ki
nM
ΔG°
kcal/mole
IC50
nM
Kd
nM
EC50/IC50
nM
koff
s-1
kon
M-1s-1
pHTemp
°C
Cytochrome P450 3A4
(Homo sapiens (Human))
BDBM50257176
(CHEMBL2324396)
Show SMILES Fc1cc(Oc2ccc(cc2-c2ccnnc2)C(F)(F)F)c(Cl)cc1S(=O)(=O)Nc1cscn1
Show InChI InChI=1S/C20H11ClF4N4O3S2/c21-14-6-18(34(30,31)29-19-9-33-10-26-19)15(22)7-17(14)32-16-2-1-12(20(23,24)25)5-13(16)11-3-4-27-28-8-11/h1-10,29H
Reactome pathway
n/an/a>3.00E+4n/an/an/an/an/an/a
Icagen Inc. , 4222 Emperor Blvd no. 350, Durham, North Carolina 27703, United States.
Curated by ChEMBL
Assay Description
Inhibition of CYP3A4 (unknown origin)
J Med Chem 60: 7029-7042 (2017)
Article DOI: 10.1021/acs.jmedchem.7b00598
BindingDB Entry DOI: 10.7270/Q21G0PQF
Sodium channel protein type 5 subunit alpha
(Homo sapiens (Human))
BDBM50257176
(CHEMBL2324396)
Show SMILES Fc1cc(Oc2ccc(cc2-c2ccnnc2)C(F)(F)F)c(Cl)cc1S(=O)(=O)Nc1cscn1
Show InChI InChI=1S/C20H11ClF4N4O3S2/c21-14-6-18(34(30,31)29-19-9-33-10-26-19)15(22)7-17(14)32-16-2-1-12(20(23,24)25)5-13(16)11-3-4-27-28-8-11/h1-10,29H
n/an/a 2.25E+4n/an/an/an/an/an/a
Icagen Inc. , 4222 Emperor Blvd no. 350, Durham, North Carolina 27703, United States.
Curated by ChEMBL
Assay Description
Inhibition of human NaV1.5 expressed in HEK cells assessed as half inactivation potential at -120 mV holding potential by automated patch clamp metho...
J Med Chem 60: 7029-7042 (2017)
Article DOI: 10.1021/acs.jmedchem.7b00598
BindingDB Entry DOI: 10.7270/Q21G0PQF
Sodium channel protein type 9 subunit alpha
(Homo sapiens (Human))
BDBM50257176
(CHEMBL2324396)
Show SMILES Fc1cc(Oc2ccc(cc2-c2ccnnc2)C(F)(F)F)c(Cl)cc1S(=O)(=O)Nc1cscn1
Show InChI InChI=1S/C20H11ClF4N4O3S2/c21-14-6-18(34(30,31)29-19-9-33-10-26-19)15(22)7-17(14)32-16-2-1-12(20(23,24)25)5-13(16)11-3-4-27-28-8-11/h1-10,29H
n/an/a 32n/an/an/an/an/an/a
AstraZeneca
Curated by ChEMBL
Assay Description
Inhibition of NaV1.7 ion channel (unknown origin)
Bioorg Med Chem Lett 23: 261-3 (2013)
Article DOI: 10.1016/j.bmcl.2012.10.102
BindingDB Entry DOI: 10.7270/Q2445QD6
Cytochrome P450 2C9
(Homo sapiens (Human))
BDBM50257176
(CHEMBL2324396)
Show SMILES Fc1cc(Oc2ccc(cc2-c2ccnnc2)C(F)(F)F)c(Cl)cc1S(=O)(=O)Nc1cscn1
Show InChI InChI=1S/C20H11ClF4N4O3S2/c21-14-6-18(34(30,31)29-19-9-33-10-26-19)15(22)7-17(14)32-16-2-1-12(20(23,24)25)5-13(16)11-3-4-27-28-8-11/h1-10,29H
Reactome pathway
n/an/a 1.37E+3n/an/an/an/an/an/a
Icagen Inc. , 4222 Emperor Blvd no. 350, Durham, North Carolina 27703, United States.
Curated by ChEMBL
Assay Description
Inhibition of CYP2C9 (unknown origin)
J Med Chem 60: 7029-7042 (2017)
Article DOI: 10.1021/acs.jmedchem.7b00598
BindingDB Entry DOI: 10.7270/Q21G0PQF
Sodium channel protein type 9 subunit alpha
(Homo sapiens (Human))
BDBM50257176
(CHEMBL2324396)
Show SMILES Fc1cc(Oc2ccc(cc2-c2ccnnc2)C(F)(F)F)c(Cl)cc1S(=O)(=O)Nc1cscn1
Show InChI InChI=1S/C20H11ClF4N4O3S2/c21-14-6-18(34(30,31)29-19-9-33-10-26-19)15(22)7-17(14)32-16-2-1-12(20(23,24)25)5-13(16)11-3-4-27-28-8-11/h1-10,29H
n/an/a 26n/an/an/an/an/an/a
Icagen Inc. , 4222 Emperor Blvd no. 350, Durham, North Carolina 27703, United States.
Curated by ChEMBL
Assay Description
Inhibition of human NaV1.7 expressed in HEK cells assessed as half inactivation potential at -120 mV holding potential by automated patch clamp metho...
J Med Chem 60: 7029-7042 (2017)
Article DOI: 10.1021/acs.jmedchem.7b00598
BindingDB Entry DOI: 10.7270/Q21G0PQF