BDBM50257212 CHEMBL2325021
SMILES: FC(F)(F)c1ccc(Oc2ccc(cc2C#N)S(=O)(=O)Nc2ncns2)c(c1)-c1ccnnc1
InChI Key: InChIKey=XURGDBWYPRLMBT-UHFFFAOYSA-N
Data: 5 IC50
Activity Spreadsheet -- Enzyme Inhibition Constant Data from BindingDB
Found 5 hits for monomerid = 50257212
Trg + Lig
Ki
nM
ΔG°
kcal/mole
IC50
nM
Kd
nM
EC50/IC50
nM
koff
s-1
kon
M-1s-1
pHTemp
°C
Cytochrome P450 2C9
(Homo sapiens (Human))
BDBM50257212
(CHEMBL2325021)
Show SMILES FC(F)(F)c1ccc(Oc2ccc(cc2C#N)S(=O)(=O)Nc2ncns2)c(c1)-c1ccnnc1
Show InChI InChI=1S/C20H11F3N6O3S2/c21-20(22,23)14-1-3-18(16(8-14)12-5-6-26-27-10-12)32-17-4-2-15(7-13(17)9-24)34(30,31)29-19-25-11-28-33-19/h1-8,10-11H,(H,25,28,29)
Reactome pathway
n/an/a 2.20E+3n/an/an/an/an/an/a
Icagen Inc. , 4222 Emperor Blvd no. 350, Durham, North Carolina 27703, United States.
Curated by ChEMBL
Assay Description
Inhibition of CYP2C9 (unknown origin)
J Med Chem 60: 7029-7042 (2017)
Article DOI: 10.1021/acs.jmedchem.7b00598
BindingDB Entry DOI: 10.7270/Q21G0PQF
Sodium channel protein type 9 subunit alpha
(Homo sapiens (Human))
BDBM50257212
(CHEMBL2325021)
Show SMILES FC(F)(F)c1ccc(Oc2ccc(cc2C#N)S(=O)(=O)Nc2ncns2)c(c1)-c1ccnnc1
Show InChI InChI=1S/C20H11F3N6O3S2/c21-20(22,23)14-1-3-18(16(8-14)12-5-6-26-27-10-12)32-17-4-2-15(7-13(17)9-24)34(30,31)29-19-25-11-28-33-19/h1-8,10-11H,(H,25,28,29)
n/an/a 13n/an/an/an/an/an/a
Icagen Inc. , 4222 Emperor Blvd no. 350, Durham, North Carolina 27703, United States.
Curated by ChEMBL
Assay Description
Inhibition of human NaV1.7 expressed in HEK cells assessed as half inactivation potential at -120 mV holding potential by automated patch clamp metho...
J Med Chem 60: 7029-7042 (2017)
Article DOI: 10.1021/acs.jmedchem.7b00598
BindingDB Entry DOI: 10.7270/Q21G0PQF
Sodium channel protein type 9 subunit alpha
(Homo sapiens (Human))
BDBM50257212
(CHEMBL2325021)
Show SMILES FC(F)(F)c1ccc(Oc2ccc(cc2C#N)S(=O)(=O)Nc2ncns2)c(c1)-c1ccnnc1
Show InChI InChI=1S/C20H11F3N6O3S2/c21-20(22,23)14-1-3-18(16(8-14)12-5-6-26-27-10-12)32-17-4-2-15(7-13(17)9-24)34(30,31)29-19-25-11-28-33-19/h1-8,10-11H,(H,25,28,29)
n/an/a 9.80n/an/an/an/an/an/a
AstraZeneca
Curated by ChEMBL
Assay Description
Inhibition of NaV1.7 ion channel (unknown origin)
Bioorg Med Chem Lett 23: 261-3 (2013)
Article DOI: 10.1016/j.bmcl.2012.10.102
BindingDB Entry DOI: 10.7270/Q2445QD6
Cytochrome P450 3A4
(Homo sapiens (Human))
BDBM50257212
(CHEMBL2325021)
Show SMILES FC(F)(F)c1ccc(Oc2ccc(cc2C#N)S(=O)(=O)Nc2ncns2)c(c1)-c1ccnnc1
Show InChI InChI=1S/C20H11F3N6O3S2/c21-20(22,23)14-1-3-18(16(8-14)12-5-6-26-27-10-12)32-17-4-2-15(7-13(17)9-24)34(30,31)29-19-25-11-28-33-19/h1-8,10-11H,(H,25,28,29)
Reactome pathway
n/an/a 1.27E+3n/an/an/an/an/an/a
Icagen Inc. , 4222 Emperor Blvd no. 350, Durham, North Carolina 27703, United States.
Curated by ChEMBL
Assay Description
Inhibition of CYP3A4 (unknown origin)
J Med Chem 60: 7029-7042 (2017)
Article DOI: 10.1021/acs.jmedchem.7b00598
BindingDB Entry DOI: 10.7270/Q21G0PQF
Sodium channel protein type 5 subunit alpha
(Homo sapiens (Human))
BDBM50257212
(CHEMBL2325021)
Show SMILES FC(F)(F)c1ccc(Oc2ccc(cc2C#N)S(=O)(=O)Nc2ncns2)c(c1)-c1ccnnc1
Show InChI InChI=1S/C20H11F3N6O3S2/c21-20(22,23)14-1-3-18(16(8-14)12-5-6-26-27-10-12)32-17-4-2-15(7-13(17)9-24)34(30,31)29-19-25-11-28-33-19/h1-8,10-11H,(H,25,28,29)
n/an/a 3.51E+4n/an/an/an/an/an/a
Icagen Inc. , 4222 Emperor Blvd no. 350, Durham, North Carolina 27703, United States.
Curated by ChEMBL
Assay Description
Inhibition of human NaV1.5 expressed in HEK cells assessed as half inactivation potential at -120 mV holding potential by automated patch clamp metho...
J Med Chem 60: 7029-7042 (2017)
Article DOI: 10.1021/acs.jmedchem.7b00598
BindingDB Entry DOI: 10.7270/Q21G0PQF