BDBM50257369 CHEMBL4082713
SMILES: O=C(CNc1cccc(c1)C(=O)NCc1ccccc1)N\N=C1/CCCc2cnccc12
InChI Key: InChIKey=JOJIACUBCDTHHJ-BYNJWEBRSA-N
Data: 3 IC50
Activity Spreadsheet -- Enzyme Inhibition Constant Data from BindingDB
Found 3 hits for monomerid = 50257369
Trg + Lig
Ki
nM
ΔG°
kcal/mole
IC50
nM
Kd
nM
EC50/IC50
nM
koff
s-1
kon
M-1s-1
pHTemp
°C
PKC alpha and beta-2
(Homo sapiens (Human))
BDBM50257369
(CHEMBL4082713)
Show SMILES O=C(CNc1cccc(c1)C(=O)NCc1ccccc1)N\N=C1/CCCc2cnccc12
Show InChI InChI=1S/C25H25N5O2/c31-24(30-29-23-11-5-9-20-16-26-13-12-22(20)23)17-27-21-10-4-8-19(14-21)25(32)28-15-18-6-2-1-3-7-18/h1-4,6-8,10,12-14,16,27H,5,9,11,15,17H2,(H,28,32)(H,30,31)/b29-23+
NCI pathway
Reactome pathway
n/an/a>1.00E+4n/an/an/an/an/an/a
Shonan Research Center, Pharmaceutical Research Division, Takeda Pharmaceutical Co., Ltd. , 26-1, Muraoka-Higashi 2-Chome, Fujisawa, Kanagawa 251-8555, Japan.
Curated by ChEMBL
Assay Description
Inhibition of human PKCalpha active using MBP as substrate after 60 mins in presence of [gamma-32]ATP by scintillation counting
J Med Chem 60: 6942-6990 (2017)
Article DOI: 10.1021/acs.jmedchem.7b00443
BindingDB Entry DOI: 10.7270/Q280552Z
Beta-adrenergic receptor kinase 1
(Homo sapiens (Human))
BDBM50257369
(CHEMBL4082713)
Show SMILES O=C(CNc1cccc(c1)C(=O)NCc1ccccc1)N\N=C1/CCCc2cnccc12
Show InChI InChI=1S/C25H25N5O2/c31-24(30-29-23-11-5-9-20-16-26-13-12-22(20)23)17-27-21-10-4-8-19(14-21)25(32)28-15-18-6-2-1-3-7-18/h1-4,6-8,10,12-14,16,27H,5,9,11,15,17H2,(H,28,32)(H,30,31)/b29-23+
Reactome pathway
n/an/a 20n/an/an/an/an/an/a
Shonan Research Center, Pharmaceutical Research Division, Takeda Pharmaceutical Co., Ltd. , 26-1, Muraoka-Higashi 2-Chome, Fujisawa, Kanagawa 251-8555, Japan.
Curated by ChEMBL
Assay Description
Inhibition of human GRK2 expressed in HEK-B2 cells assessed as isoproterenol-stimulated cAMP accumulation preincubation for 20 mins followed by isopr...
J Med Chem 60: 6942-6990 (2017)
Article DOI: 10.1021/acs.jmedchem.7b00443
BindingDB Entry DOI: 10.7270/Q280552Z
Rho-associated protein kinase 2
(Homo sapiens (Human))
BDBM50257369
(CHEMBL4082713)
Show SMILES O=C(CNc1cccc(c1)C(=O)NCc1ccccc1)N\N=C1/CCCc2cnccc12
Show InChI InChI=1S/C25H25N5O2/c31-24(30-29-23-11-5-9-20-16-26-13-12-22(20)23)17-27-21-10-4-8-19(14-21)25(32)28-15-18-6-2-1-3-7-18/h1-4,6-8,10,12-14,16,27H,5,9,11,15,17H2,(H,28,32)(H,30,31)/b29-23+
n/an/a 58n/an/an/an/an/an/a
Shonan Research Center, Pharmaceutical Research Division, Takeda Pharmaceutical Co., Ltd. , 26-1, Muraoka-Higashi 2-Chome, Fujisawa, Kanagawa 251-8555, Japan.
Curated by ChEMBL
Assay Description
Inhibition of recombinant human N-terminal GST-tagged ROCK2 catalytic domain (1 to 553 residues) expressed in baculovirus expression system using STK...
J Med Chem 60: 6942-6990 (2017)
Article DOI: 10.1021/acs.jmedchem.7b00443
BindingDB Entry DOI: 10.7270/Q280552Z