BDBM50257385 CHEMBL4076320
SMILES: O=C(Nc1ccccc1)c1cccc(NCc2nc(n[nH]2)-c2ccncc2)c1
InChI Key: InChIKey=ZHDPMPLGMKQADI-UHFFFAOYSA-N
Data: 3 IC50
Activity Spreadsheet -- Enzyme Inhibition Constant Data from BindingDB
Found 3 hits for monomerid = 50257385
Trg + Lig
Ki
nM
ΔG°
kcal/mole
IC50
nM
Kd
nM
EC50/IC50
nM
koff
s-1
kon
M-1s-1
pHTemp
°C
PKC alpha and beta-2
(Homo sapiens (Human))
BDBM50257385
(CHEMBL4076320)
Show SMILES O=C(Nc1ccccc1)c1cccc(NCc2nc(n[nH]2)-c2ccncc2)c1
Show InChI InChI=1S/C21H18N6O/c28-21(24-17-6-2-1-3-7-17)16-5-4-8-18(13-16)23-14-19-25-20(27-26-19)15-9-11-22-12-10-15/h1-13,23H,14H2,(H,24,28)(H,25,26,27)
NCI pathway
Reactome pathway
n/an/a 680n/an/an/an/an/an/a
Shonan Research Center, Pharmaceutical Research Division, Takeda Pharmaceutical Co., Ltd. , 26-1, Muraoka-Higashi 2-Chome, Fujisawa, Kanagawa 251-8555, Japan.
Curated by ChEMBL
Assay Description
Inhibition of human PKCalpha active using MBP as substrate after 60 mins in presence of [gamma-32]ATP by scintillation counting
J Med Chem 60: 6942-6990 (2017)
Article DOI: 10.1021/acs.jmedchem.7b00443
BindingDB Entry DOI: 10.7270/Q280552Z
Beta-adrenergic receptor kinase 1
(Homo sapiens (Human))
BDBM50257385
(CHEMBL4076320)
Show SMILES O=C(Nc1ccccc1)c1cccc(NCc2nc(n[nH]2)-c2ccncc2)c1
Show InChI InChI=1S/C21H18N6O/c28-21(24-17-6-2-1-3-7-17)16-5-4-8-18(13-16)23-14-19-25-20(27-26-19)15-9-11-22-12-10-15/h1-13,23H,14H2,(H,24,28)(H,25,26,27)
Reactome pathway
n/an/a 54n/an/an/an/an/an/a
Shonan Research Center, Pharmaceutical Research Division, Takeda Pharmaceutical Co., Ltd. , 26-1, Muraoka-Higashi 2-Chome, Fujisawa, Kanagawa 251-8555, Japan.
Curated by ChEMBL
Assay Description
Inhibition of human GRK2 expressed in HEK-B2 cells assessed as isoproterenol-stimulated cAMP accumulation preincubation for 20 mins followed by isopr...
J Med Chem 60: 6942-6990 (2017)
Article DOI: 10.1021/acs.jmedchem.7b00443
BindingDB Entry DOI: 10.7270/Q280552Z
Rho-associated protein kinase 2
(Homo sapiens (Human))
BDBM50257385
(CHEMBL4076320)
Show SMILES O=C(Nc1ccccc1)c1cccc(NCc2nc(n[nH]2)-c2ccncc2)c1
Show InChI InChI=1S/C21H18N6O/c28-21(24-17-6-2-1-3-7-17)16-5-4-8-18(13-16)23-14-19-25-20(27-26-19)15-9-11-22-12-10-15/h1-13,23H,14H2,(H,24,28)(H,25,26,27)
n/an/a 31n/an/an/an/an/an/a
Shonan Research Center, Pharmaceutical Research Division, Takeda Pharmaceutical Co., Ltd. , 26-1, Muraoka-Higashi 2-Chome, Fujisawa, Kanagawa 251-8555, Japan.
Curated by ChEMBL
Assay Description
Inhibition of recombinant human N-terminal GST-tagged ROCK2 catalytic domain (1 to 553 residues) expressed in baculovirus expression system using STK...
J Med Chem 60: 6942-6990 (2017)
Article DOI: 10.1021/acs.jmedchem.7b00443
BindingDB Entry DOI: 10.7270/Q280552Z