BDBM50257478 2-(4'-Hydroxyphenyl)-3-[(4''carboxy-3''-hydroxy-1,1'-biphenyl-4-yl)methyl]-4H-1-benzopyran-4-one::CHEMBL494537
SMILES: OC(=O)c1ccc(cc1O)-c1ccc(Cc2c(oc3ccccc3c2=O)-c2ccc(O)cc2)cc1
InChI Key: InChIKey=RLZLKCASKCHDTQ-UHFFFAOYSA-N
Data: 3 IC50
Activity Spreadsheet -- Enzyme Inhibition Constant Data from BindingDB
Found 3 hits for monomerid = 50257478
Trg + Lig
Ki
nM
ΔG°
kcal/mole
IC50
nM
Kd
nM
EC50/IC50
nM
koff
s-1
kon
M-1s-1
pHTemp
°C
Low molecular weight phosphotyrosine protein phosphatase
(Homo sapiens (Human))
BDBM50257478
(2-(4'-Hydroxyphenyl)-3-[(4''carboxy-3''-hydroxy-1,...)
Show SMILES OC(=O)c1ccc(cc1O)-c1ccc(Cc2c(oc3ccccc3c2=O)-c2ccc(O)cc2)cc1
Show InChI InChI=1S/C29H20O6/c30-21-12-9-19(10-13-21)28-24(27(32)23-3-1-2-4-26(23)35-28)15-17-5-7-18(8-6-17)20-11-14-22(29(33)34)25(31)16-20/h1-14,16,30-31H,15H2,(H,33,34)
n/an/a 700n/an/an/an/an/an/a
University of Modena and R.E.
Curated by ChEMBL
Assay Description
Inhibition of human cloned LMW-PTP isoform 1 expressed in Escherichia coli TB1
Bioorg Med Chem 17: 2658-72 (2009)
Article DOI: 10.1016/j.bmc.2009.02.060
BindingDB Entry DOI: 10.7270/Q2K0745F
Protein-tyrosine phosphatase 1B
(Homo sapiens (Human))
BDBM50257478
(2-(4'-Hydroxyphenyl)-3-[(4''carboxy-3''-hydroxy-1,...)
Show SMILES OC(=O)c1ccc(cc1O)-c1ccc(Cc2c(oc3ccccc3c2=O)-c2ccc(O)cc2)cc1
Show InChI InChI=1S/C29H20O6/c30-21-12-9-19(10-13-21)28-24(27(32)23-3-1-2-4-26(23)35-28)15-17-5-7-18(8-6-17)20-11-14-22(29(33)34)25(31)16-20/h1-14,16,30-31H,15H2,(H,33,34)
NCI pathway
Reactome pathway
n/an/a 900n/an/an/an/an/an/a
University of Modena and R.E.
Curated by ChEMBL
Assay Description
Inhibition of human cloned PTP1B expressed in Escherichia coli TB1
Bioorg Med Chem 17: 2658-72 (2009)
Article DOI: 10.1016/j.bmc.2009.02.060
BindingDB Entry DOI: 10.7270/Q2K0745F
Low molecular weight phosphotyrosine protein phosphatase
(Homo sapiens (Human))
BDBM50257478
(2-(4'-Hydroxyphenyl)-3-[(4''carboxy-3''-hydroxy-1,...)
Show SMILES OC(=O)c1ccc(cc1O)-c1ccc(Cc2c(oc3ccccc3c2=O)-c2ccc(O)cc2)cc1
Show InChI InChI=1S/C29H20O6/c30-21-12-9-19(10-13-21)28-24(27(32)23-3-1-2-4-26(23)35-28)15-17-5-7-18(8-6-17)20-11-14-22(29(33)34)25(31)16-20/h1-14,16,30-31H,15H2,(H,33,34)
n/an/a 5.70E+3n/an/an/an/an/an/a
University of Modena and R.E.
Curated by ChEMBL
Assay Description
Inhibition of human cloned LMW-PTP isoform 2 expressed in Escherichia coli TB1
Bioorg Med Chem 17: 2658-72 (2009)
Article DOI: 10.1016/j.bmc.2009.02.060
BindingDB Entry DOI: 10.7270/Q2K0745F