null
SMILES: Clc1ccc(OC2CN(C2)S(=O)(=O)c2ccc3CCNCCc3c2)cc1
InChI Key: InChIKey=BRCOAUXQCKALMG-UHFFFAOYSA-N
Activity Spreadsheet -- Enzyme Inhibition Constant Data from BindingDB
Found 3 hits for monomerid = 50257570
Trg + Lig
Ki
nM
ΔG°
kcal/mole
IC50
nM
Kd
nM
EC50/IC50
nM
koff
s-1
kon
M-1s-1
pHTemp
°C
Potassium voltage-gated channel subfamily H member 2
(Homo sapiens (Human))
BDBM50257570
(7-(3-(4-chlorophenoxy)azetidin-1-ylsulfonyl)-2,3,4...)
Show SMILES Clc1ccc(OC2CN(C2)S(=O)(=O)c2ccc3CCNCCc3c2)cc1
Show InChI InChI=1S/C19H21ClN2O3S/c20-16-2-4-17(5-3-16)25-18-12-22(13-18)26(23,24)19-6-1-14-7-9-21-10-8-15(14)11-19/h1-6,11,18,21H,7-10,12-13H2
Reactome pathway
2.09E+3n/an/an/an/an/an/an/an/a
Pfizer Global Research and Development
Curated by ChEMBL
Assay Description
Binding affinity to human ERG
Bioorg Med Chem Lett 19: 1871-5 (2009)
Article DOI: 10.1016/j.bmcl.2009.02.071
BindingDB Entry DOI: 10.7270/Q2GB23XH
5-hydroxytryptamine receptor 2B
(Homo sapiens (Human))
BDBM50257570
(7-(3-(4-chlorophenoxy)azetidin-1-ylsulfonyl)-2,3,4...)
Show SMILES Clc1ccc(OC2CN(C2)S(=O)(=O)c2ccc3CCNCCc3c2)cc1
Show InChI InChI=1S/C19H21ClN2O3S/c20-16-2-4-17(5-3-16)25-18-12-22(13-18)26(23,24)19-6-1-14-7-9-21-10-8-15(14)11-19/h1-6,11,18,21H,7-10,12-13H2
Reactome pathway
n/an/an/an/a>9.94E+3n/an/an/an/a
Pfizer Global Research and Development
Curated by ChEMBL
Assay Description
Agonist activity at human recombinant 5HT2B receptor by cell-based system
Bioorg Med Chem Lett 19: 1871-5 (2009)
Article DOI: 10.1016/j.bmcl.2009.02.071
BindingDB Entry DOI: 10.7270/Q2GB23XH
5-hydroxytryptamine receptor 2C
(Homo sapiens (Human))
BDBM50257570
(7-(3-(4-chlorophenoxy)azetidin-1-ylsulfonyl)-2,3,4...)
Show SMILES Clc1ccc(OC2CN(C2)S(=O)(=O)c2ccc3CCNCCc3c2)cc1
Show InChI InChI=1S/C19H21ClN2O3S/c20-16-2-4-17(5-3-16)25-18-12-22(13-18)26(23,24)19-6-1-14-7-9-21-10-8-15(14)11-19/h1-6,11,18,21H,7-10,12-13H2
Reactome pathway
n/an/an/an/a 28n/an/an/an/a
Pfizer Global Research and Development
Curated by ChEMBL
Assay Description
Agonist activity at human recombinant 5HT2C receptor expressed in CHOK1 cells assessed as calcium mobilization by FLIPR assay
Bioorg Med Chem Lett 19: 1871-5 (2009)
Article DOI: 10.1016/j.bmcl.2009.02.071
BindingDB Entry DOI: 10.7270/Q2GB23XH