BDBM50258001 CHEMBL492370::N-(3,4-dichlorophenyl)-1-(methylsulfonyl)spiro[indoline-3,4'-piperidine]-1'-carboxamide
SMILES: CS(=O)(=O)N1CC2(CCN(CC2)C(=O)Nc2ccc(Cl)c(Cl)c2)c2ccccc12
InChI Key: InChIKey=QPRZIOLHQZYFHB-UHFFFAOYSA-N
Data: 1 IC50
Activity Spreadsheet -- Enzyme Inhibition Constant Data from BindingDB
Found 1 hit for monomerid = 50258001
Trg + Lig
Ki
nM
ΔG°
kcal/mole
IC50
nM
Kd
nM
EC50/IC50
nM
koff
s-1
kon
M-1s-1
pHTemp
°C
Neuropeptide Y receptor type 5 ( NPY Y5)
(Homo sapiens (Human))
BDBM50258001
(CHEMBL492370 | N-(3,4-dichlorophenyl)-1-(methylsul...)
Show SMILES CS(=O)(=O)N1CC2(CCN(CC2)C(=O)Nc2ccc(Cl)c(Cl)c2)c2ccccc12
Show InChI InChI=1S/C20H21Cl2N3O3S/c1-29(27,28)25-13-20(15-4-2-3-5-18(15)25)8-10-24(11-9-20)19(26)23-14-6-7-16(21)17(22)12-14/h2-7,12H,8-11,13H2,1H3,(H,23,26)
n/an/a 0.200n/an/an/an/an/an/a
Tsukuba Research Institute
Curated by ChEMBL
Assay Description
Displacement of [125I]PYY from human recombinant Y5 receptor expressed in mouse LMtk cells
Bioorg Med Chem Lett 19: 1564-8 (2009)
Article DOI: 10.1016/j.bmcl.2009.02.035
BindingDB Entry DOI: 10.7270/Q2TQ61FT