null
SMILES: COc1ccc2[nH]c(C)c(CC(=O)N[C@@H](CCCCCC(O)=O)c3nc(c[nH]3)-c3ccc4ccccc4c3)c2c1
InChI Key: InChIKey=WOSBHMZOLQKCOL-NDEPHWFRSA-N
Activity Spreadsheet -- Enzyme Inhibition Constant Data from BindingDB
Found 1 hit for monomerid = 50258550
Trg + Lig
Ki
nM
ΔG°
kcal/mole
IC50
nM
Kd
nM
EC50/IC50
nM
koff
s-1
kon
M-1s-1
pHTemp
°C
Histone deacetylase 1
(Homo sapiens (Human))
BDBM50258550
((S)-7-(2-(5-methoxy-2-methyl-1H-indol-3-yl)acetami...)
Show SMILES COc1ccc2[nH]c(C)c(CC(=O)N[C@@H](CCCCCC(O)=O)c3nc(c[nH]3)-c3ccc4ccccc4c3)c2c1 |r|
Show InChI InChI=1S/C32H34N4O4/c1-20-25(26-17-24(40-2)14-15-27(26)34-20)18-30(37)35-28(10-4-3-5-11-31(38)39)32-33-19-29(36-32)23-13-12-21-8-6-7-9-22(21)16-23/h6-9,12-17,19,28,34H,3-5,10-11,18H2,1-2H3,(H,33,36)(H,35,37)(H,38,39)/t28-/m0/s1
NCI pathway
Reactome pathway
n/an/a 28n/an/an/an/an/an/a
IRBM/Merck Research Laboratories
Curated by ChEMBL
Assay Description
Inhibition of C-terminal FLAG tagged HDAC1 (unknown origin)
Bioorg Med Chem Lett 19: 3081-4 (2009)
Article DOI: 10.1016/j.bmcl.2009.04.011
BindingDB Entry DOI: 10.7270/Q2P84BSJ