BDBM50258565 (S)-6-(2-(1-methyl-1H-pyrazol-4-yl)phenyl)-6,7-dihydro-5H-pyrrolo[1,2-a]imidazole::CHEMBL508084
SMILES: Cn1cc(cn1)-c1ccccc1[C@@H]1Cc2nccn2C1
InChI Key: InChIKey=QUSFXAATAPEOAD-GFCCVEGCSA-N
Data: 1 KI  1 EC50
Activity Spreadsheet -- Enzyme Inhibition Constant Data from BindingDB
Found 2 hits for monomerid = 50258565
Trg + Lig
Ki
nM
ΔG°
kcal/mole
IC50
nM
Kd
nM
EC50/IC50
nM
koff
s-1
kon
M-1s-1
pHTemp
°C
Alpha-2A adrenergic receptor
(Homo sapiens (Human))
BDBM50258565
((S)-6-(2-(1-methyl-1H-pyrazol-4-yl)phenyl)-6,7-dih...)
Show SMILES Cn1cc(cn1)-c1ccccc1[C@@H]1Cc2nccn2C1 |r|
Show InChI InChI=1S/C16H16N4/c1-19-10-13(9-18-19)15-5-3-2-4-14(15)12-8-16-17-6-7-20(16)11-12/h2-7,9-10,12H,8,11H2,1H3/t12-/m1/s1
380n/an/an/an/an/an/an/an/a
Pfizer Global Research and Development
Curated by ChEMBL
Assay Description
Inhibition of adrenergic alpha2A receptor (unknown origin)
Bioorg Med Chem Lett 19: 3113-7 (2009)
Article DOI: 10.1016/j.bmcl.2009.03.166
BindingDB Entry DOI: 10.7270/Q2WS8T5T
Alpha-1A adrenergic receptor
(Homo sapiens (Human))
BDBM50258565
((S)-6-(2-(1-methyl-1H-pyrazol-4-yl)phenyl)-6,7-dih...)
Show SMILES Cn1cc(cn1)-c1ccccc1[C@@H]1Cc2nccn2C1 |r|
Show InChI InChI=1S/C16H16N4/c1-19-10-13(9-18-19)15-5-3-2-4-14(15)12-8-16-17-6-7-20(16)11-12/h2-7,9-10,12H,8,11H2,1H3/t12-/m1/s1
Reactome pathway
n/an/an/an/a 9n/an/an/an/a
Pfizer Global Research and Development
Curated by ChEMBL
Assay Description
Agonist activity at human adrenergic alpha1A receptor expressed in CHO cells assessed as calcium mobilization by FLIPR
Bioorg Med Chem Lett 19: 3113-7 (2009)
Article DOI: 10.1016/j.bmcl.2009.03.166
BindingDB Entry DOI: 10.7270/Q2WS8T5T