BDBM50258599 CHEMBL4070968
SMILES: COc1cccc(c1)-c1cc(C(=O)N2CCN(Cc3ccccc3)CC2)c2ccccc2n1
InChI Key: InChIKey=VKSVJQOJUSUALE-UHFFFAOYSA-N
Data: 1 IC50
Activity Spreadsheet -- Enzyme Inhibition Constant Data from BindingDB
Found 1 hit for monomerid = 50258599
Trg + Lig
Ki
nM
ΔG°
kcal/mole
IC50
nM
Kd
nM
EC50/IC50
nM
koff
s-1
kon
M-1s-1
pHTemp
°C
Serine/threonine-protein kinase WNK1
(Homo sapiens (Human))
BDBM50258599
(CHEMBL4070968)
Show SMILES COc1cccc(c1)-c1cc(C(=O)N2CCN(Cc3ccccc3)CC2)c2ccccc2n1
Show InChI InChI=1S/C28H27N3O2/c1-33-23-11-7-10-22(18-23)27-19-25(24-12-5-6-13-26(24)29-27)28(32)31-16-14-30(15-17-31)20-21-8-3-2-4-9-21/h2-13,18-19H,14-17,20H2,1H3
Reactome pathway
n/an/a 623n/an/an/an/an/an/a
Novartis Institutes for BioMedical Research, Inc. , Cambridge, Massachusetts 02139-4133, United States.
Curated by ChEMBL
Assay Description
Allosteric inhibition of WNK1 (unknown origin) expressed in HEK293 cells co-expressing flag-OSR1 assessed as reduction in sorbitol-stimulated OSR1 ph...
J Med Chem 60: 7099-7107 (2017)
Article DOI: 10.1021/acs.jmedchem.7b00708
BindingDB Entry DOI: 10.7270/Q29W0HXP