BDBM50258796 5-(3,4-dimethoxyphenyl)-4-(1,4-dimethyl-1H-indol-5-ylamino)nicotinonitrile::CHEMBL466037
SMILES: COc1ccc(cc1OC)-c1cncc(C#N)c1Nc1ccc2n(C)ccc2c1C
InChI Key: InChIKey=JSYNGGRTKCWJMF-UHFFFAOYSA-N
Data: 2 IC50
Activity Spreadsheet -- Enzyme Inhibition Constant Data from BindingDB
Found 2 hits for monomerid = 50258796
Trg + Lig
Ki
nM
ΔG°
kcal/mole
IC50
nM
Kd
nM
EC50/IC50
nM
koff
s-1
kon
M-1s-1
pHTemp
°C
Protein kinase C delta type
(Homo sapiens (Human))
BDBM50258796
(5-(3,4-dimethoxyphenyl)-4-(1,4-dimethyl-1H-indol-5...)
Show SMILES COc1ccc(cc1OC)-c1cncc(C#N)c1Nc1ccc2n(C)ccc2c1C
Show InChI InChI=1S/C24H22N4O2/c1-15-18-9-10-28(2)21(18)7-6-20(15)27-24-17(12-25)13-26-14-19(24)16-5-8-22(29-3)23(11-16)30-4/h5-11,13-14H,1-4H3,(H,26,27)
NCI pathway
Reactome pathway
n/an/a 1.40E+3n/an/an/an/an/an/a
Wyeth Research
Curated by ChEMBL
Assay Description
Inhibition of human PKCdelta by IMAP assay
Bioorg Med Chem Lett 19: 3623-6 (2009)
Article DOI: 10.1016/j.bmcl.2009.04.126
BindingDB Entry DOI: 10.7270/Q29W0FD4
Protein kinase C theta type
(Homo sapiens (Human))
BDBM50258796
(5-(3,4-dimethoxyphenyl)-4-(1,4-dimethyl-1H-indol-5...)
Show SMILES COc1ccc(cc1OC)-c1cncc(C#N)c1Nc1ccc2n(C)ccc2c1C
Show InChI InChI=1S/C24H22N4O2/c1-15-18-9-10-28(2)21(18)7-6-20(15)27-24-17(12-25)13-26-14-19(24)16-5-8-22(29-3)23(11-16)30-4/h5-11,13-14H,1-4H3,(H,26,27)
NCI pathway
Reactome pathway
n/an/a 260n/an/an/an/an/an/a
Wyeth Research
Curated by ChEMBL
Assay Description
Inhibition of human PKCtheta by IMAP assay
Bioorg Med Chem Lett 19: 3623-6 (2009)
Article DOI: 10.1016/j.bmcl.2009.04.126
BindingDB Entry DOI: 10.7270/Q29W0FD4