null
SMILES: O=C1Nc2cc(\C=C\c3ccccc3)ccc2C1=O
InChI Key: InChIKey=ZQOJVXBKHOCLGH-VOTSOKGWSA-N
Activity Spreadsheet -- Enzyme Inhibition Constant Data from BindingDB
Found 6 hits for monomerid = 50258885
Trg + Lig
Ki
nM
ΔG°
kcal/mole
IC50
nM
Kd
nM
EC50/IC50
nM
koff
s-1
kon
M-1s-1
pHTemp
°C
Amine oxidase [flavin-containing] B
(Homo sapiens (Human))
BDBM50258885
((E)-6-Styrylisatin | CHEMBL450239)
Show SMILES O=C1Nc2cc(\C=C\c3ccccc3)ccc2C1=O
Show InChI InChI=1S/C16H11NO2/c18-15-13-9-8-12(10-14(13)17-16(15)19)7-6-11-4-2-1-3-5-11/h1-10H,(H,17,18,19)/b7-6+
266n/an/an/an/an/an/an/an/a
North-West University
Curated by ChEMBL
Assay Description
Inhibition of human recombinant MAOB expressed in insect cells by fluorescence assay
Bioorg Med Chem 19: 261-74 (2011)
Article DOI: 10.1016/j.bmc.2010.11.028
BindingDB Entry DOI: 10.7270/Q2DR2VSB
Amine oxidase [flavin-containing] B
(Homo sapiens (Human))
BDBM50258885
((E)-6-Styrylisatin | CHEMBL450239)
Show SMILES O=C1Nc2cc(\C=C\c3ccccc3)ccc2C1=O
Show InChI InChI=1S/C16H11NO2/c18-15-13-9-8-12(10-14(13)17-16(15)19)7-6-11-4-2-1-3-5-11/h1-10H,(H,17,18,19)/b7-6+
560n/an/an/an/an/an/an/an/a
North-West University
Curated by ChEMBL
Assay Description
Inhibition of recombinant wild-type MAOB from human liver expressed in Pichia pastoris
Bioorg Med Chem Lett 19: 2509-13 (2009)
Article DOI: 10.1016/j.bmcl.2009.03.030
BindingDB Entry DOI: 10.7270/Q2C53KQB
Amine oxidase [flavin-containing] A
(Homo sapiens (Human))
BDBM50258885
((E)-6-Styrylisatin | CHEMBL450239)
Show SMILES O=C1Nc2cc(\C=C\c3ccccc3)ccc2C1=O
Show InChI InChI=1S/C16H11NO2/c18-15-13-9-8-12(10-14(13)17-16(15)19)7-6-11-4-2-1-3-5-11/h1-10H,(H,17,18,19)/b7-6+
717n/an/an/an/an/an/an/an/a
North-West University
Curated by ChEMBL
Assay Description
Inhibition of human recombinant MAOA expressed in insect cells by fluorescence assay
Bioorg Med Chem 19: 261-74 (2011)
Article DOI: 10.1016/j.bmc.2010.11.028
BindingDB Entry DOI: 10.7270/Q2DR2VSB
Amine oxidase [flavin-containing] A
(Homo sapiens (Human))
BDBM50258885
((E)-6-Styrylisatin | CHEMBL450239)
Show SMILES O=C1Nc2cc(\C=C\c3ccccc3)ccc2C1=O
Show InChI InChI=1S/C16H11NO2/c18-15-13-9-8-12(10-14(13)17-16(15)19)7-6-11-4-2-1-3-5-11/h1-10H,(H,17,18,19)/b7-6+
2.20E+4n/an/an/an/an/an/an/an/a
North-West University
Curated by ChEMBL
Assay Description
Inhibition of recombinant wild-type MAOA from human liver expressed in Pichia pastoris
Bioorg Med Chem Lett 19: 2509-13 (2009)
Article DOI: 10.1016/j.bmcl.2009.03.030
BindingDB Entry DOI: 10.7270/Q2C53KQB
Amine oxidase [flavin-containing] B
(Homo sapiens (Human))
BDBM50258885
((E)-6-Styrylisatin | CHEMBL450239)
Show SMILES O=C1Nc2cc(\C=C\c3ccccc3)ccc2C1=O
Show InChI InChI=1S/C16H11NO2/c18-15-13-9-8-12(10-14(13)17-16(15)19)7-6-11-4-2-1-3-5-11/h1-10H,(H,17,18,19)/b7-6+
n/an/a 617n/an/an/an/an/an/a
North-West University
Curated by ChEMBL
Assay Description
Inhibition of human recombinant MAOB expressed in insect cells by fluorescence assay
Bioorg Med Chem 19: 261-74 (2011)
Article DOI: 10.1016/j.bmc.2010.11.028
BindingDB Entry DOI: 10.7270/Q2DR2VSB
Amine oxidase [flavin-containing] A
(Homo sapiens (Human))
BDBM50258885
((E)-6-Styrylisatin | CHEMBL450239)
Show SMILES O=C1Nc2cc(\C=C\c3ccccc3)ccc2C1=O
Show InChI InChI=1S/C16H11NO2/c18-15-13-9-8-12(10-14(13)17-16(15)19)7-6-11-4-2-1-3-5-11/h1-10H,(H,17,18,19)/b7-6+
n/an/a 2.72E+3n/an/an/an/an/an/a
North-West University
Curated by ChEMBL
Assay Description
Inhibition of human recombinant MAOA expressed in insect cells by fluorescence assay
Bioorg Med Chem 19: 261-74 (2011)
Article DOI: 10.1016/j.bmc.2010.11.028
BindingDB Entry DOI: 10.7270/Q2DR2VSB