BDBM50258950 CHEMBL468322::N-{4-[(3,4-Dioxo-2-{[(1R)-1-phenylethyl]amino}-cyclobut-1-en-1-yl)amino]pyridin-2-yl}nicotinamide
SMILES: C[C@@H](Nc1c(Nc2ccnc(NC(=O)c3cccnc3)c2)c(=O)c1=O)c1ccccc1
InChI Key: InChIKey=MAIPYHWPCVNDJP-CQSZACIVSA-N
Data: 1 IC50
Activity Spreadsheet -- Enzyme Inhibition Constant Data from BindingDB
Found 1 hit for monomerid = 50258950
Trg + Lig
Ki
nM
ΔG°
kcal/mole
IC50
nM
Kd
nM
EC50/IC50
nM
koff
s-1
kon
M-1s-1
pHTemp
°C
MAP kinase-activated protein kinase 2
(Homo sapiens (Human))
BDBM50258950
(CHEMBL468322 | N-{4-[(3,4-Dioxo-2-{[(1R)-1-phenyle...)
Show SMILES C[C@@H](Nc1c(Nc2ccnc(NC(=O)c3cccnc3)c2)c(=O)c1=O)c1ccccc1 |r|
Show InChI InChI=1S/C23H19N5O3/c1-14(15-6-3-2-4-7-15)26-19-20(22(30)21(19)29)27-17-9-11-25-18(12-17)28-23(31)16-8-5-10-24-13-16/h2-14,26H,1H3,(H2,25,27,28,31)/t14-/m1/s1
NCI pathway
Reactome pathway
n/an/a 1.30E+3n/an/an/an/an/an/a
Wyeth Research
Curated by ChEMBL
Assay Description
Inhibition of human recombinant MK2
Bioorg Med Chem 17: 3342-51 (2009)
Article DOI: 10.1016/j.bmc.2009.03.041
BindingDB Entry DOI: 10.7270/Q2WW7HK4