BDBM50259324 1-(4-Aminophenyl)-4-benzoyl-5-phenyl-N-(5-sulfamoyl-1,3,4-thiadiazole-2-yl)-1H-pyrazole-3-carboxamide::CHEMBL513141
SMILES: Nc1ccc(cc1)-n1nc(C(=O)Nc2nnc(s2)S(N)(=O)=O)c(C(=O)c2ccccc2)c1-c1ccccc1
InChI Key: InChIKey=RGCGLSPRERTEBT-UHFFFAOYSA-N
Data: 2 KI  4 IC50
Activity Spreadsheet -- Enzyme Inhibition Constant Data from BindingDB
Found 6 hits for monomerid = 50259324
Trg + Lig
Ki
nM
ΔG°
kcal/mole
IC50
nM
Kd
nM
EC50/IC50
nM
koff
s-1
kon
M-1s-1
pHTemp
°C
Carbonic anhydrase 2
(Homo sapiens (Human))
BDBM50259324
(1-(4-Aminophenyl)-4-benzoyl-5-phenyl-N-(5-sulfamoy...)
Show SMILES Nc1ccc(cc1)-n1nc(C(=O)Nc2nnc(s2)S(N)(=O)=O)c(C(=O)c2ccccc2)c1-c1ccccc1
Show InChI InChI=1S/C25H19N7O4S2/c26-17-11-13-18(14-12-17)32-21(15-7-3-1-4-8-15)19(22(33)16-9-5-2-6-10-16)20(31-32)23(34)28-24-29-30-25(37-24)38(27,35)36/h1-14H,26H2,(H2,27,35,36)(H,28,29,34)
Reactome pathway
1.56E+3n/an/an/an/an/an/an/an/a
Dumlupinar University
Curated by ChEMBL
Assay Description
Inhibition of human carbonic anhydrase 2 by Lineweaver-Burk plot
Bioorg Med Chem 17: 3295-301 (2009)
Article DOI: 10.1016/j.bmc.2009.03.048
BindingDB Entry DOI: 10.7270/Q2DZ087F
Carbonic anhydrase 1
(Homo sapiens (Human))
BDBM50259324
(1-(4-Aminophenyl)-4-benzoyl-5-phenyl-N-(5-sulfamoy...)
Show SMILES Nc1ccc(cc1)-n1nc(C(=O)Nc2nnc(s2)S(N)(=O)=O)c(C(=O)c2ccccc2)c1-c1ccccc1
Show InChI InChI=1S/C25H19N7O4S2/c26-17-11-13-18(14-12-17)32-21(15-7-3-1-4-8-15)19(22(33)16-9-5-2-6-10-16)20(31-32)23(34)28-24-29-30-25(37-24)38(27,35)36/h1-14H,26H2,(H2,27,35,36)(H,28,29,34)
NCI pathway
Reactome pathway
2.42E+3n/an/an/an/an/an/an/an/a
Dumlupinar University
Curated by ChEMBL
Assay Description
Inhibition of human carbonic anhydrase 1 by Lineweaver-Burk plot
Bioorg Med Chem 17: 3295-301 (2009)
Article DOI: 10.1016/j.bmc.2009.03.048
BindingDB Entry DOI: 10.7270/Q2DZ087F
Carbonic anhydrase 2
(Homo sapiens (Human))
BDBM50259324
(1-(4-Aminophenyl)-4-benzoyl-5-phenyl-N-(5-sulfamoy...)
Show SMILES Nc1ccc(cc1)-n1nc(C(=O)Nc2nnc(s2)S(N)(=O)=O)c(C(=O)c2ccccc2)c1-c1ccccc1
Show InChI InChI=1S/C25H19N7O4S2/c26-17-11-13-18(14-12-17)32-21(15-7-3-1-4-8-15)19(22(33)16-9-5-2-6-10-16)20(31-32)23(34)28-24-29-30-25(37-24)38(27,35)36/h1-14H,26H2,(H2,27,35,36)(H,28,29,34)
Reactome pathway
n/an/a 1.59E+3n/an/an/an/an/an/a
Dumlupinar University
Curated by ChEMBL
Assay Description
Inhibition of CO2-hydratase activity of human carbonic anhydrase 2 by CO2 hydration method
Bioorg Med Chem 17: 3295-301 (2009)
Article DOI: 10.1016/j.bmc.2009.03.048
BindingDB Entry DOI: 10.7270/Q2DZ087F
Carbonic anhydrase 1
(Homo sapiens (Human))
BDBM50259324
(1-(4-Aminophenyl)-4-benzoyl-5-phenyl-N-(5-sulfamoy...)
Show SMILES Nc1ccc(cc1)-n1nc(C(=O)Nc2nnc(s2)S(N)(=O)=O)c(C(=O)c2ccccc2)c1-c1ccccc1
Show InChI InChI=1S/C25H19N7O4S2/c26-17-11-13-18(14-12-17)32-21(15-7-3-1-4-8-15)19(22(33)16-9-5-2-6-10-16)20(31-32)23(34)28-24-29-30-25(37-24)38(27,35)36/h1-14H,26H2,(H2,27,35,36)(H,28,29,34)
NCI pathway
Reactome pathway
n/an/a 4.30E+3n/an/an/an/an/an/a
Dumlupinar University
Curated by ChEMBL
Assay Description
Inhibition of esterase activity of human carbonic anhydrase 1 by CO2 hydration method
Bioorg Med Chem 17: 3295-301 (2009)
Article DOI: 10.1016/j.bmc.2009.03.048
BindingDB Entry DOI: 10.7270/Q2DZ087F
Carbonic anhydrase 1
(Homo sapiens (Human))
BDBM50259324
(1-(4-Aminophenyl)-4-benzoyl-5-phenyl-N-(5-sulfamoy...)
Show SMILES Nc1ccc(cc1)-n1nc(C(=O)Nc2nnc(s2)S(N)(=O)=O)c(C(=O)c2ccccc2)c1-c1ccccc1
Show InChI InChI=1S/C25H19N7O4S2/c26-17-11-13-18(14-12-17)32-21(15-7-3-1-4-8-15)19(22(33)16-9-5-2-6-10-16)20(31-32)23(34)28-24-29-30-25(37-24)38(27,35)36/h1-14H,26H2,(H2,27,35,36)(H,28,29,34)
NCI pathway
Reactome pathway
n/an/a 4.20E+3n/an/an/an/an/an/a
Dumlupinar University
Curated by ChEMBL
Assay Description
Inhibition of CO2-hydratase activity of human carbonic anhydrase 1 by CO2 hydration method
Bioorg Med Chem 17: 3295-301 (2009)
Article DOI: 10.1016/j.bmc.2009.03.048
BindingDB Entry DOI: 10.7270/Q2DZ087F
Carbonic anhydrase 2
(Homo sapiens (Human))
BDBM50259324
(1-(4-Aminophenyl)-4-benzoyl-5-phenyl-N-(5-sulfamoy...)
Show SMILES Nc1ccc(cc1)-n1nc(C(=O)Nc2nnc(s2)S(N)(=O)=O)c(C(=O)c2ccccc2)c1-c1ccccc1
Show InChI InChI=1S/C25H19N7O4S2/c26-17-11-13-18(14-12-17)32-21(15-7-3-1-4-8-15)19(22(33)16-9-5-2-6-10-16)20(31-32)23(34)28-24-29-30-25(37-24)38(27,35)36/h1-14H,26H2,(H2,27,35,36)(H,28,29,34)
Reactome pathway
n/an/a 4.20E+3n/an/an/an/an/an/a
Dumlupinar University
Curated by ChEMBL
Assay Description
Inhibition of esterase activity of human carbonic anhydrase 2 by CO2 hydration method
Bioorg Med Chem 17: 3295-301 (2009)
Article DOI: 10.1016/j.bmc.2009.03.048
BindingDB Entry DOI: 10.7270/Q2DZ087F