BDBM50259409 CHEMBL4062820
SMILES: CC[C@@H](CO)Nc1ccc2ncc(-c3cc4ccccc4[nH]3)n2n1
InChI Key: InChIKey=CQZSVQKINMHLBO-ZDUSSCGKSA-N
Data: 11 IC50
Activity Spreadsheet -- Enzyme Inhibition Constant Data from BindingDB
Found 11 hits for monomerid = 50259409
Trg + Lig
Ki
nM
ΔG°
kcal/mole
IC50
nM
Kd
nM
EC50/IC50
nM
koff
s-1
kon
M-1s-1
pHTemp
°C
Dual specificity protein kinase CLK1
(Mus musculus)
BDBM50259409
(CHEMBL4062820)
Show SMILES CC[C@@H](CO)Nc1ccc2ncc(-c3cc4ccccc4[nH]3)n2n1 |r|
Show InChI InChI=1S/C18H19N5O/c1-2-13(11-24)20-17-7-8-18-19-10-16(23(18)22-17)15-9-12-5-3-4-6-14(12)21-15/h3-10,13,21,24H,2,11H2,1H3,(H,20,22)/t13-/m0/s1
n/an/a 110n/an/an/an/an/an/a
ManRos Therapeutics, Perharidy Research Center, 29680 Roscoff, Bretagne, France; Unité de Technologies Chimiques et Biologiques pour la Santé, Université Paris Descartes, UMR-S 1022 Inserm, 4 avenue
Curated by ChEMBL
Assay Description
Inhibition of GST tagged recombinant mouse CLK1 expressed in Escherichia coli using RS peptide as substrate after 30 mins by [gamma-33P]ATP based sci...
Eur J Med Chem 125: 696-709 (2017)
Article DOI: 10.1016/j.ejmech.2016.09.064
BindingDB Entry DOI: 10.7270/Q2M61NPG
Dual specificity tyrosine-phosphorylation-regulated kinase 2
(Homo sapiens (Human))
BDBM50259409
(CHEMBL4062820)
Show SMILES CC[C@@H](CO)Nc1ccc2ncc(-c3cc4ccccc4[nH]3)n2n1 |r|
Show InChI InChI=1S/C18H19N5O/c1-2-13(11-24)20-17-7-8-18-19-10-16(23(18)22-17)15-9-12-5-3-4-6-14(12)21-15/h3-10,13,21,24H,2,11H2,1H3,(H,20,22)/t13-/m0/s1
NCI pathway
n/an/a 210n/an/an/an/an/an/a
ManRos Therapeutics, Perharidy Research Center, 29680 Roscoff, Bretagne, France; Unité de Technologies Chimiques et Biologiques pour la Santé, Université Paris Descartes, UMR-S 1022 Inserm, 4 avenue
Curated by ChEMBL
Assay Description
Inhibition of GST tagged recombinant human DYRK2 expressed in Escherichia coli using using woodtide as substrate after 30 mins by [gamma-33P]ATP base...
Eur J Med Chem 125: 696-709 (2017)
Article DOI: 10.1016/j.ejmech.2016.09.064
BindingDB Entry DOI: 10.7270/Q2M61NPG
Dual specificity protein kinase CLK3
(Mus musculus)
BDBM50259409
(CHEMBL4062820)
Show SMILES CC[C@@H](CO)Nc1ccc2ncc(-c3cc4ccccc4[nH]3)n2n1 |r|
Show InChI InChI=1S/C18H19N5O/c1-2-13(11-24)20-17-7-8-18-19-10-16(23(18)22-17)15-9-12-5-3-4-6-14(12)21-15/h3-10,13,21,24H,2,11H2,1H3,(H,20,22)/t13-/m0/s1
n/an/a 2.40E+3n/an/an/an/an/an/a
ManRos Therapeutics, Perharidy Research Center, 29680 Roscoff, Bretagne, France; Unité de Technologies Chimiques et Biologiques pour la Santé, Université Paris Descartes, UMR-S 1022 Inserm, 4 avenue
Curated by ChEMBL
Assay Description
Inhibition of GST tagged recombinant mouse CLK3 expressed in Escherichia coli using RS peptide as substrate after 30 mins by [gamma-33P]ATP based sci...
Eur J Med Chem 125: 696-709 (2017)
Article DOI: 10.1016/j.ejmech.2016.09.064
BindingDB Entry DOI: 10.7270/Q2M61NPG
Dual specificity protein kinase CLK2
(Mus musculus)
BDBM50259409
(CHEMBL4062820)
Show SMILES CC[C@@H](CO)Nc1ccc2ncc(-c3cc4ccccc4[nH]3)n2n1 |r|
Show InChI InChI=1S/C18H19N5O/c1-2-13(11-24)20-17-7-8-18-19-10-16(23(18)22-17)15-9-12-5-3-4-6-14(12)21-15/h3-10,13,21,24H,2,11H2,1H3,(H,20,22)/t13-/m0/s1
n/an/a 380n/an/an/an/an/an/a
ManRos Therapeutics, Perharidy Research Center, 29680 Roscoff, Bretagne, France; Unité de Technologies Chimiques et Biologiques pour la Santé, Université Paris Descartes, UMR-S 1022 Inserm, 4 avenue
Curated by ChEMBL
Assay Description
Inhibitory concentration against dipeptidyl peptidase IV
Eur J Med Chem 125: 696-709 (2017)
Article DOI: 10.1016/j.ejmech.2016.09.064
BindingDB Entry DOI: 10.7270/Q2M61NPG
Dual specificity tyrosine-phosphorylation-regulated kinase 1A
(Homo sapiens (Human))
BDBM50259409
(CHEMBL4062820)
Show SMILES CC[C@@H](CO)Nc1ccc2ncc(-c3cc4ccccc4[nH]3)n2n1 |r|
Show InChI InChI=1S/C18H19N5O/c1-2-13(11-24)20-17-7-8-18-19-10-16(23(18)22-17)15-9-12-5-3-4-6-14(12)21-15/h3-10,13,21,24H,2,11H2,1H3,(H,20,22)/t13-/m0/s1
Reactome pathway
n/an/a 340n/an/an/an/an/an/a
ManRos Therapeutics, Perharidy Research Center, 29680 Roscoff, Bretagne, France; Unité de Technologies Chimiques et Biologiques pour la Santé, Université Paris Descartes, UMR-S 1022 Inserm, 4 avenue
Curated by ChEMBL
Assay Description
Inhibition of GST tagged recombinant human DYRK1A expressed in Escherichia coli using woodtide as substrate after 30 mins by [gamma-33P]ATP based sci...
Eur J Med Chem 125: 696-709 (2017)
Article DOI: 10.1016/j.ejmech.2016.09.064
BindingDB Entry DOI: 10.7270/Q2M61NPG
Cyclin-A2/Cyclin-dependent kinase 2
(Homo sapiens (Human))
BDBM50259409
(CHEMBL4062820)
Show SMILES CC[C@@H](CO)Nc1ccc2ncc(-c3cc4ccccc4[nH]3)n2n1 |r|
Show InChI InChI=1S/C18H19N5O/c1-2-13(11-24)20-17-7-8-18-19-10-16(23(18)22-17)15-9-12-5-3-4-6-14(12)21-15/h3-10,13,21,24H,2,11H2,1H3,(H,20,22)/t13-/m0/s1
NCI pathway
Reactome pathway
n/an/a 4.10E+3n/an/an/an/an/an/a
ManRos Therapeutics, Perharidy Research Center, 29680 Roscoff, Bretagne, France; Unité de Technologies Chimiques et Biologiques pour la Santé, Université Paris Descartes, UMR-S 1022 Inserm, 4 avenue
Curated by ChEMBL
Assay Description
Inhibition of human recombinant CDK2/cyclin A after 30 mins by [gamma-33P]ATP based scintillation counting analysis
Eur J Med Chem 125: 696-709 (2017)
Article DOI: 10.1016/j.ejmech.2016.09.064
BindingDB Entry DOI: 10.7270/Q2M61NPG
Dual specificity tyrosine-phosphorylation-regulated kinase 3
(Homo sapiens (Human))
BDBM50259409
(CHEMBL4062820)
Show SMILES CC[C@@H](CO)Nc1ccc2ncc(-c3cc4ccccc4[nH]3)n2n1 |r|
Show InChI InChI=1S/C18H19N5O/c1-2-13(11-24)20-17-7-8-18-19-10-16(23(18)22-17)15-9-12-5-3-4-6-14(12)21-15/h3-10,13,21,24H,2,11H2,1H3,(H,20,22)/t13-/m0/s1
n/an/a 120n/an/an/an/an/an/a
ManRos Therapeutics, Perharidy Research Center, 29680 Roscoff, Bretagne, France; Unité de Technologies Chimiques et Biologiques pour la Santé, Université Paris Descartes, UMR-S 1022 Inserm, 4 avenue
Curated by ChEMBL
Assay Description
Inhibition of GST tagged recombinant human DYRK3 expressed in Escherichia coli using woodtide as substrate after 30 mins by [gamma-33P]ATP based scin...
Eur J Med Chem 125: 696-709 (2017)
Article DOI: 10.1016/j.ejmech.2016.09.064
BindingDB Entry DOI: 10.7270/Q2M61NPG
Dual specificity tyrosine-phosphorylation-regulated kinase 1B
(Homo sapiens (Human))
BDBM50259409
(CHEMBL4062820)
Show SMILES CC[C@@H](CO)Nc1ccc2ncc(-c3cc4ccccc4[nH]3)n2n1 |r|
Show InChI InChI=1S/C18H19N5O/c1-2-13(11-24)20-17-7-8-18-19-10-16(23(18)22-17)15-9-12-5-3-4-6-14(12)21-15/h3-10,13,21,24H,2,11H2,1H3,(H,20,22)/t13-/m0/s1
n/an/a 220n/an/an/an/an/an/a
ManRos Therapeutics, Perharidy Research Center, 29680 Roscoff, Bretagne, France; Unité de Technologies Chimiques et Biologiques pour la Santé, Université Paris Descartes, UMR-S 1022 Inserm, 4 avenue
Curated by ChEMBL
Assay Description
Inhibition of GST tagged recombinant human DYRK1B expressed in Escherichia coli using woodtide as substrate after 30 mins by [gamma-33P]ATP based sci...
Eur J Med Chem 125: 696-709 (2017)
Article DOI: 10.1016/j.ejmech.2016.09.064
BindingDB Entry DOI: 10.7270/Q2M61NPG
Cyclin-dependent kinase 5 activator 1
(Homo sapiens (Human))
BDBM50259409
(CHEMBL4062820)
Show SMILES CC[C@@H](CO)Nc1ccc2ncc(-c3cc4ccccc4[nH]3)n2n1 |r|
Show InChI InChI=1S/C18H19N5O/c1-2-13(11-24)20-17-7-8-18-19-10-16(23(18)22-17)15-9-12-5-3-4-6-14(12)21-15/h3-10,13,21,24H,2,11H2,1H3,(H,20,22)/t13-/m0/s1
NCI pathway
Reactome pathway
n/an/a 1.20E+3n/an/an/an/an/an/a
ManRos Therapeutics, Perharidy Research Center, 29680 Roscoff, Bretagne, France; Unité de Technologies Chimiques et Biologiques pour la Santé, Université Paris Descartes, UMR-S 1022 Inserm, 4 avenue
Curated by ChEMBL
Assay Description
Inhibition of human recombinant CDK5/p25 after 30 mins by [gamma-33P]ATP based scintillation counting analysis
Eur J Med Chem 125: 696-709 (2017)
Article DOI: 10.1016/j.ejmech.2016.09.064
BindingDB Entry DOI: 10.7270/Q2M61NPG
Cyclin-T1/Cyclin-dependent kinase 9
(Homo sapiens (Human))
BDBM50259409
(CHEMBL4062820)
Show SMILES CC[C@@H](CO)Nc1ccc2ncc(-c3cc4ccccc4[nH]3)n2n1 |r|
Show InChI InChI=1S/C18H19N5O/c1-2-13(11-24)20-17-7-8-18-19-10-16(23(18)22-17)15-9-12-5-3-4-6-14(12)21-15/h3-10,13,21,24H,2,11H2,1H3,(H,20,22)/t13-/m0/s1
Reactome pathway
n/an/a 1.10E+3n/an/an/an/an/an/a
ManRos Therapeutics, Perharidy Research Center, 29680 Roscoff, Bretagne, France; Unité de Technologies Chimiques et Biologiques pour la Santé, Université Paris Descartes, UMR-S 1022 Inserm, 4 avenue
Curated by ChEMBL
Assay Description
Inhibition of human recombinant CDK9/cyclin T expressed in insect cells using CDK7/9-tide as substrate after 30 mins by [gamma-33P]ATP based scintill...
Eur J Med Chem 125: 696-709 (2017)
Article DOI: 10.1016/j.ejmech.2016.09.064
BindingDB Entry DOI: 10.7270/Q2M61NPG
Dual specificity protein kinase CLK4
(Mus musculus)
BDBM50259409
(CHEMBL4062820)
Show SMILES CC[C@@H](CO)Nc1ccc2ncc(-c3cc4ccccc4[nH]3)n2n1 |r|
Show InChI InChI=1S/C18H19N5O/c1-2-13(11-24)20-17-7-8-18-19-10-16(23(18)22-17)15-9-12-5-3-4-6-14(12)21-15/h3-10,13,21,24H,2,11H2,1H3,(H,20,22)/t13-/m0/s1
n/an/a 120n/an/an/an/an/an/a
ManRos Therapeutics, Perharidy Research Center, 29680 Roscoff, Bretagne, France; Unité de Technologies Chimiques et Biologiques pour la Santé, Université Paris Descartes, UMR-S 1022 Inserm, 4 avenue
Curated by ChEMBL
Assay Description
Inhibition of GST tagged recombinant mouse CLK4 expressed in Escherichia coli using RS peptide as substrate after 30 mins by [gamma-33P]ATP based sci...
Eur J Med Chem 125: 696-709 (2017)
Article DOI: 10.1016/j.ejmech.2016.09.064
BindingDB Entry DOI: 10.7270/Q2M61NPG