BDBM50259435 (1R,5S)-3-Acetyl-7-[4-(3-phenoxy-propyl)-phenyl]-3,9-diaza-bicyclo[3.3.1]non-6-ene-6-carboxylic acid cyclopropyl-(2,3-dichloro-benzyl)-amide::CHEMBL467850
SMILES: CC(=O)N1C[C@H]2CC(=C([C@@H](C1)N2)C(=O)N(Cc1cccc(Cl)c1Cl)C1CC1)c1ccc(CCCOc2ccccc2)cc1
InChI Key: InChIKey=WAMZPADKKRSGLD-WXGMZPBLSA-N
Data: 2 IC50
Activity Spreadsheet -- Enzyme Inhibition Constant Data from BindingDB
Found 2 hits for monomerid = 50259435
Trg + Lig
Ki
nM
ΔG°
kcal/mole
IC50
nM
Kd
nM
EC50/IC50
nM
koff
s-1
kon
M-1s-1
pHTemp
°C
Renin
(Homo sapiens (Human))
BDBM50259435
((1R,5S)-3-Acetyl-7-[4-(3-phenoxy-propyl)-phenyl]-3...)
Show SMILES CC(=O)N1C[C@H]2CC(=C([C@@H](C1)N2)C(=O)N(Cc1cccc(Cl)c1Cl)C1CC1)c1ccc(CCCOc2ccccc2)cc1 |r,c:7,TLB:27:7:11:3.10.4,1:3:11:8.7.6,THB:12:8:11:3.10.4|
Show InChI InChI=1S/C35H37Cl2N3O3/c1-23(41)39-21-27-19-30(25-14-12-24(13-15-25)7-6-18-43-29-9-3-2-4-10-29)33(32(22-39)38-27)35(42)40(28-16-17-28)20-26-8-5-11-31(36)34(26)37/h2-5,8-15,27-28,32,38H,6-7,16-22H2,1H3/t27-,32-/m1/s1
Reactome pathway
n/an/a 7.70n/an/an/an/an/an/a
Actelion Pharmaceuticals Ltd.
Curated by ChEMBL
Assay Description
Inhibition of human recombinant rennin in buffer assessed as accumulation of angiotensin 1 using human tetradecapeptide by immunoassay
J Med Chem 52: 3689-702 (2009)
Article DOI: 10.1021/jm900022f
BindingDB Entry DOI: 10.7270/Q2PC3391
3D
3D Structure (docked)
Renin
(Homo sapiens (Human))
BDBM50259435
((1R,5S)-3-Acetyl-7-[4-(3-phenoxy-propyl)-phenyl]-3...)
Show SMILES CC(=O)N1C[C@H]2CC(=C([C@@H](C1)N2)C(=O)N(Cc1cccc(Cl)c1Cl)C1CC1)c1ccc(CCCOc2ccccc2)cc1 |r,c:7,TLB:27:7:11:3.10.4,1:3:11:8.7.6,THB:12:8:11:3.10.4|
Show InChI InChI=1S/C35H37Cl2N3O3/c1-23(41)39-21-27-19-30(25-14-12-24(13-15-25)7-6-18-43-29-9-3-2-4-10-29)33(32(22-39)38-27)35(42)40(28-16-17-28)20-26-8-5-11-31(36)34(26)37/h2-5,8-15,27-28,32,38H,6-7,16-22H2,1H3/t27-,32-/m1/s1
Reactome pathway
n/an/a 699n/an/an/an/an/an/a
Actelion Pharmaceuticals Ltd.
Curated by ChEMBL
Assay Description
Inhibition of human recombinant rennin in human plasma assessed as accumulation of angiotensin 1 using human tetradecapeptide by immunoassay
J Med Chem 52: 3689-702 (2009)
Article DOI: 10.1021/jm900022f
BindingDB Entry DOI: 10.7270/Q2PC3391
3D
3D Structure (docked)