BDBM50259445 (1R,5S)-3-Acetyl-7-{4-[3-(2-chloro-3,6-difluoro-phenoxy)-propyl]-phenyl}-3,9-diazabicyclo[3.3.1]non-6-ene-6-carboxylic acid cyclopropyl-(2,3-dichloro-benzyl)-amide::CHEMBL454732
SMILES: CC(=O)N1C[C@H]2CC(=C([C@@H](C1)N2)C(=O)N(Cc1cccc(Cl)c1Cl)C1CC1)c1ccc(CCCOc2c(F)ccc(F)c2Cl)cc1
InChI Key: InChIKey=RYSYSMTZIBDICU-AYWVHJORSA-N
Data: 2 IC50
Activity Spreadsheet -- Enzyme Inhibition Constant Data from BindingDB
Found 2 hits for monomerid = 50259445
Trg + Lig
Ki
nM
ΔG°
kcal/mole
IC50
nM
Kd
nM
EC50/IC50
nM
koff
s-1
kon
M-1s-1
pHTemp
°C
Renin
(Homo sapiens (Human))
BDBM50259445
((1R,5S)-3-Acetyl-7-{4-[3-(2-chloro-3,6-difluoro-ph...)
Show SMILES CC(=O)N1C[C@H]2CC(=C([C@@H](C1)N2)C(=O)N(Cc1cccc(Cl)c1Cl)C1CC1)c1ccc(CCCOc2c(F)ccc(F)c2Cl)cc1 |r,wU:9.11,wD:5.12,c:7,TLB:27:7:11:3.10.4,1:3:11:8.7.6,THB:12:8:11:3.10.4,(15.07,-12.49,;13.7,-11.78,;13.64,-10.24,;12.4,-12.6,;11.86,-14.07,;10.14,-13.73,;10.53,-12.41,;10.07,-11.42,;8.76,-11.39,;9.48,-12.9,;11.29,-13.23,;8.95,-14.36,;7.22,-11.33,;6.5,-9.97,;6.41,-12.64,;4.87,-12.58,;4.05,-13.89,;4.78,-15.24,;3.97,-16.54,;2.42,-16.49,;1.7,-15.13,;.16,-15.07,;2.52,-13.82,;1.8,-12.46,;7.13,-14,;7.08,-15.53,;8.44,-14.81,;10.72,-10.63,;12.26,-10.63,;13.02,-9.29,;12.25,-7.96,;13.01,-6.62,;14.55,-6.62,;15.32,-5.28,;16.86,-5.27,;17.62,-3.94,;19.17,-3.94,;19.94,-5.27,;19.93,-2.61,;19.16,-1.28,;17.61,-1.3,;16.83,.03,;16.85,-2.62,;15.31,-2.63,;10.7,-7.97,;9.94,-9.31,)|
Show InChI InChI=1S/C35H34Cl3F2N3O3/c1-20(44)42-18-24-16-26(22-9-7-21(8-10-22)4-3-15-46-34-29(40)14-13-28(39)33(34)38)31(30(19-42)41-24)35(45)43(25-11-12-25)17-23-5-2-6-27(36)32(23)37/h2,5-10,13-14,24-25,30,41H,3-4,11-12,15-19H2,1H3/t24-,30-/m1/s1
Reactome pathway
n/an/a 0.290n/an/an/an/an/an/a
Actelion Pharmaceuticals Ltd.
Curated by ChEMBL
Assay Description
Inhibition of human recombinant rennin in buffer assessed as accumulation of angiotensin 1 using human tetradecapeptide by immunoassay
J Med Chem 52: 3689-702 (2009)
Article DOI: 10.1021/jm900022f
BindingDB Entry DOI: 10.7270/Q2PC3391
3D
3D Structure (docked)
Renin
(Homo sapiens (Human))
BDBM50259445
((1R,5S)-3-Acetyl-7-{4-[3-(2-chloro-3,6-difluoro-ph...)
Show SMILES CC(=O)N1C[C@H]2CC(=C([C@@H](C1)N2)C(=O)N(Cc1cccc(Cl)c1Cl)C1CC1)c1ccc(CCCOc2c(F)ccc(F)c2Cl)cc1 |r,wU:9.11,wD:5.12,c:7,TLB:27:7:11:3.10.4,1:3:11:8.7.6,THB:12:8:11:3.10.4,(15.07,-12.49,;13.7,-11.78,;13.64,-10.24,;12.4,-12.6,;11.86,-14.07,;10.14,-13.73,;10.53,-12.41,;10.07,-11.42,;8.76,-11.39,;9.48,-12.9,;11.29,-13.23,;8.95,-14.36,;7.22,-11.33,;6.5,-9.97,;6.41,-12.64,;4.87,-12.58,;4.05,-13.89,;4.78,-15.24,;3.97,-16.54,;2.42,-16.49,;1.7,-15.13,;.16,-15.07,;2.52,-13.82,;1.8,-12.46,;7.13,-14,;7.08,-15.53,;8.44,-14.81,;10.72,-10.63,;12.26,-10.63,;13.02,-9.29,;12.25,-7.96,;13.01,-6.62,;14.55,-6.62,;15.32,-5.28,;16.86,-5.27,;17.62,-3.94,;19.17,-3.94,;19.94,-5.27,;19.93,-2.61,;19.16,-1.28,;17.61,-1.3,;16.83,.03,;16.85,-2.62,;15.31,-2.63,;10.7,-7.97,;9.94,-9.31,)|
Show InChI InChI=1S/C35H34Cl3F2N3O3/c1-20(44)42-18-24-16-26(22-9-7-21(8-10-22)4-3-15-46-34-29(40)14-13-28(39)33(34)38)31(30(19-42)41-24)35(45)43(25-11-12-25)17-23-5-2-6-27(36)32(23)37/h2,5-10,13-14,24-25,30,41H,3-4,11-12,15-19H2,1H3/t24-,30-/m1/s1
Reactome pathway
n/an/a 24n/an/an/an/an/an/a
Actelion Pharmaceuticals Ltd.
Curated by ChEMBL
Assay Description
Inhibition of human recombinant rennin in human plasma assessed as accumulation of angiotensin 1 using human tetradecapeptide by immunoassay
J Med Chem 52: 3689-702 (2009)
Article DOI: 10.1021/jm900022f
BindingDB Entry DOI: 10.7270/Q2PC3391
3D
3D Structure (docked)