BDBM50259452 (1R,5S)-3-Acetyl-7-{4-[2-(2,6-dichloro-4-methyl-phenoxy)-ethoxy]-phenyl}-3,9-diaza-bicyclo-[3.3.1]non-6-ene-6-carboxylic acid cyclopropyl-(2,3-dichloro-benzyl)-amide::CHEMBL508205
SMILES: [H][C@@]12CN(C[C@@]([H])(N1)C(C(=O)N(Cc1cccc(Cl)c1Cl)C1CC1)=C(C2)c1ccc(OCCOc2c(Cl)cc(C)cc2Cl)cc1)C(C)=O
InChI Key: InChIKey=GWAFVGFJPSSQBN-WBBHLRKXSA-N
Data: 2 IC50
Activity Spreadsheet -- Enzyme Inhibition Constant Data from BindingDB
Found 2 hits for monomerid = 50259452
Trg + Lig
Ki
nM
ΔG°
kcal/mole
IC50
nM
Kd
nM
EC50/IC50
nM
koff
s-1
kon
M-1s-1
pHTemp
°C
Renin
(Homo sapiens (Human))
BDBM50259452
((1R,5S)-3-Acetyl-7-{4-[2-(2,6-dichloro-4-methyl-ph...)
Show SMILES [H][C@@]12CN(C[C@@]([H])(N1)C(C(=O)N(Cc1cccc(Cl)c1Cl)C1CC1)=C(C2)c1ccc(OCCOc2c(Cl)cc(C)cc2Cl)cc1)C(C)=O |r,wU:1.0,wD:5.5,c:26,TLB:26:24:7:3.4.2,THB:45:3:7:8.24.25,9:8:7:3.4.2,(12.06,-12.12,;11.66,-10.63,;13.38,-10.97,;13.92,-9.5,;12.81,-10.12,;11,-9.79,;9.51,-10.19,;10.46,-11.26,;10.28,-8.29,;8.74,-8.23,;8.02,-6.87,;7.92,-9.53,;6.38,-9.48,;5.57,-10.78,;6.29,-12.13,;5.48,-13.44,;3.94,-13.39,;3.21,-12.02,;1.68,-11.97,;4.03,-10.72,;3.31,-9.36,;8.64,-10.89,;8.59,-12.43,;9.95,-11.71,;11.4,-7.93,;11.93,-8.91,;12.23,-7.52,;13.77,-7.53,;14.54,-6.19,;13.76,-4.86,;14.53,-3.52,;16.07,-3.51,;16.83,-2.18,;18.37,-2.17,;19.14,-.83,;18.37,.48,;16.83,.48,;19.12,1.81,;20.67,1.83,;21.43,3.17,;21.45,.5,;20.68,-.83,;21.45,-2.17,;12.22,-4.87,;11.46,-6.2,;15.22,-8.67,;16.58,-9.39,;15.16,-7.14,)|
Show InChI InChI=1S/C35H35Cl4N3O4/c1-20-14-29(37)34(30(38)15-20)46-13-12-45-26-10-6-22(7-11-26)27-16-24-18-41(21(2)43)19-31(40-24)32(27)35(44)42(25-8-9-25)17-23-4-3-5-28(36)33(23)39/h3-7,10-11,14-15,24-25,31,40H,8-9,12-13,16-19H2,1-2H3/t24-,31-/m1/s1
Reactome pathway
n/an/a 0.160n/an/an/an/an/an/a
Actelion Pharmaceuticals Ltd.
Curated by ChEMBL
Assay Description
Inhibition of human recombinant rennin in buffer assessed as accumulation of angiotensin 1 using human tetradecapeptide by immunoassay
J Med Chem 52: 3689-702 (2009)
Article DOI: 10.1021/jm900022f
BindingDB Entry DOI: 10.7270/Q2PC3391
3D
3D Structure (docked)
Renin
(Homo sapiens (Human))
BDBM50259452
((1R,5S)-3-Acetyl-7-{4-[2-(2,6-dichloro-4-methyl-ph...)
Show SMILES [H][C@@]12CN(C[C@@]([H])(N1)C(C(=O)N(Cc1cccc(Cl)c1Cl)C1CC1)=C(C2)c1ccc(OCCOc2c(Cl)cc(C)cc2Cl)cc1)C(C)=O |r,wU:1.0,wD:5.5,c:26,TLB:26:24:7:3.4.2,THB:45:3:7:8.24.25,9:8:7:3.4.2,(12.06,-12.12,;11.66,-10.63,;13.38,-10.97,;13.92,-9.5,;12.81,-10.12,;11,-9.79,;9.51,-10.19,;10.46,-11.26,;10.28,-8.29,;8.74,-8.23,;8.02,-6.87,;7.92,-9.53,;6.38,-9.48,;5.57,-10.78,;6.29,-12.13,;5.48,-13.44,;3.94,-13.39,;3.21,-12.02,;1.68,-11.97,;4.03,-10.72,;3.31,-9.36,;8.64,-10.89,;8.59,-12.43,;9.95,-11.71,;11.4,-7.93,;11.93,-8.91,;12.23,-7.52,;13.77,-7.53,;14.54,-6.19,;13.76,-4.86,;14.53,-3.52,;16.07,-3.51,;16.83,-2.18,;18.37,-2.17,;19.14,-.83,;18.37,.48,;16.83,.48,;19.12,1.81,;20.67,1.83,;21.43,3.17,;21.45,.5,;20.68,-.83,;21.45,-2.17,;12.22,-4.87,;11.46,-6.2,;15.22,-8.67,;16.58,-9.39,;15.16,-7.14,)|
Show InChI InChI=1S/C35H35Cl4N3O4/c1-20-14-29(37)34(30(38)15-20)46-13-12-45-26-10-6-22(7-11-26)27-16-24-18-41(21(2)43)19-31(40-24)32(27)35(44)42(25-8-9-25)17-23-4-3-5-28(36)33(23)39/h3-7,10-11,14-15,24-25,31,40H,8-9,12-13,16-19H2,1-2H3/t24-,31-/m1/s1
Reactome pathway
n/an/a 7.10n/an/an/an/an/an/a
Actelion Pharmaceuticals Ltd.
Curated by ChEMBL
Assay Description
Inhibition of human recombinant rennin in human plasma assessed as accumulation of angiotensin 1 using human tetradecapeptide by immunoassay
J Med Chem 52: 3689-702 (2009)
Article DOI: 10.1021/jm900022f
BindingDB Entry DOI: 10.7270/Q2PC3391
3D
3D Structure (docked)