BDBM50259564 3-{[(1S)-2-Hydroxy-1-phenylethyl]amino}-4-(pyridin-4-ylamino)cyclobut-3-ene-1,2-dione::CHEMBL467911
SMILES: OCC(Nc1c(Nc2ccncc2)c(=O)c1=O)c1ccccc1
InChI Key: InChIKey=DAGJEDQAVYEPNE-UHFFFAOYSA-N
Data: 1 IC50
Activity Spreadsheet -- Enzyme Inhibition Constant Data from BindingDB
Found 1 hit for monomerid = 50259564
Trg + Lig
Ki
nM
ΔG°
kcal/mole
IC50
nM
Kd
nM
EC50/IC50
nM
koff
s-1
kon
M-1s-1
pHTemp
°C
MAP kinase-activated protein kinase 2
(Homo sapiens (Human))
BDBM50259564
(3-{[(1S)-2-Hydroxy-1-phenylethyl]amino}-4-(pyridin...)
Show SMILES OCC(Nc1c(Nc2ccncc2)c(=O)c1=O)c1ccccc1
Show InChI InChI=1S/C17H15N3O3/c21-10-13(11-4-2-1-3-5-11)20-15-14(16(22)17(15)23)19-12-6-8-18-9-7-12/h1-9,13,20-21H,10H2,(H,18,19)
NCI pathway
Reactome pathway
n/an/a 5.30E+3n/an/an/an/an/an/a
Wyeth Research
Curated by ChEMBL
Assay Description
Inhibition of human recombinant MK2
Bioorg Med Chem 17: 3342-51 (2009)
Article DOI: 10.1016/j.bmc.2009.03.041
BindingDB Entry DOI: 10.7270/Q2WW7HK4
3D
3D Structure (docked)