BDBM50259966 CHEMBL4092406
SMILES: COCCNCc1cc(c(F)cc1F)[C@]1(C)CCSC(N)=N1
InChI Key: InChIKey=MWGLFDPAWCGVCN-HNNXBMFYSA-N
Data: 4 IC50
Activity Spreadsheet -- Enzyme Inhibition Constant Data from BindingDB
Found 4 hits for monomerid = 50259966
Trg + Lig
Ki
nM
ΔG°
kcal/mole
IC50
nM
Kd
nM
EC50/IC50
nM
koff
s-1
kon
M-1s-1
pHTemp
°C
Cathepsin D
(Homo sapiens (Human))
BDBM50259966
(CHEMBL4092406)
Show SMILES COCCNCc1cc(c(F)cc1F)[C@]1(C)CCSC(N)=N1 |r,c:21|
Show InChI InChI=1S/C15H21F2N3OS/c1-15(3-6-22-14(18)20-15)11-7-10(9-19-4-5-21-2)12(16)8-13(11)17/h7-8,19H,3-6,9H2,1-2H3,(H2,18,20)/t15-/m0/s1
NCI pathway
Reactome pathway
n/an/a>1.00E+5n/an/an/an/an/an/a
The Scripps Research Institute
Curated by ChEMBL
Assay Description
Inhibition of Cathepsin D (unknown origin) by cell free assay
J Med Chem 60: 386-402 (2017)
Article DOI: 10.1021/acs.jmedchem.6b01451
BindingDB Entry DOI: 10.7270/Q2154KHX
Beta-secretase 1
(Homo sapiens (Human))
BDBM50259966
(CHEMBL4092406)
Show SMILES COCCNCc1cc(c(F)cc1F)[C@]1(C)CCSC(N)=N1 |r,c:21|
Show InChI InChI=1S/C15H21F2N3OS/c1-15(3-6-22-14(18)20-15)11-7-10(9-19-4-5-21-2)12(16)8-13(11)17/h7-8,19H,3-6,9H2,1-2H3,(H2,18,20)/t15-/m0/s1
n/an/a 6n/an/an/an/an/an/a
The Scripps Research Institute
Curated by ChEMBL
Assay Description
Inhibition of BACE1 in human H4 cells expressing wild type APP695 assessed as reduction in soluble APPbeta level after 18 hrs by ELISA
J Med Chem 60: 386-402 (2017)
Article DOI: 10.1021/acs.jmedchem.6b01451
BindingDB Entry DOI: 10.7270/Q2154KHX
Beta-secretase 1
(Homo sapiens (Human))
BDBM50259966
(CHEMBL4092406)
Show SMILES COCCNCc1cc(c(F)cc1F)[C@]1(C)CCSC(N)=N1 |r,c:21|
Show InChI InChI=1S/C15H21F2N3OS/c1-15(3-6-22-14(18)20-15)11-7-10(9-19-4-5-21-2)12(16)8-13(11)17/h7-8,19H,3-6,9H2,1-2H3,(H2,18,20)/t15-/m0/s1
n/an/a 8.20E+3n/an/an/an/an/an/a
The Scripps Research Institute
Curated by ChEMBL
Assay Description
Inhibition of BACE1 (unknown origin) using biotin-GLTNIKTEEISEISYEVEFR-C[oregon green]KK-OH as substrate after 3 hrs by fluorescence polarization ass...
J Med Chem 60: 386-402 (2017)
Article DOI: 10.1021/acs.jmedchem.6b01451
BindingDB Entry DOI: 10.7270/Q2154KHX
Beta-secretase 2
(Homo sapiens (Human))
BDBM50259966
(CHEMBL4092406)
Show SMILES COCCNCc1cc(c(F)cc1F)[C@]1(C)CCSC(N)=N1 |r,c:21|
Show InChI InChI=1S/C15H21F2N3OS/c1-15(3-6-22-14(18)20-15)11-7-10(9-19-4-5-21-2)12(16)8-13(11)17/h7-8,19H,3-6,9H2,1-2H3,(H2,18,20)/t15-/m0/s1
n/an/a 2.68E+4n/an/an/an/an/an/a
The Scripps Research Institute
Curated by ChEMBL
Assay Description
Inhibition of BACE2 (unknown origin) by cell free assay
J Med Chem 60: 386-402 (2017)
Article DOI: 10.1021/acs.jmedchem.6b01451
BindingDB Entry DOI: 10.7270/Q2154KHX