BDBM50260128 CHEMBL4071638
SMILES: Fc1ccc(cc1C(=O)NCc1ccccc1C(F)(F)F)[C@@H]1CCNC[C@H]1COc1ccc2OCOc2c1
InChI Key: InChIKey=VMSVZVDUEKSMRW-FPOVZHCZSA-N
Data: 3 IC50
Activity Spreadsheet -- Enzyme Inhibition Constant Data from BindingDB
Found 3 hits for monomerid = 50260128
Trg + Lig
Ki
nM
ΔG°
kcal/mole
IC50
nM
Kd
nM
EC50/IC50
nM
koff
s-1
kon
M-1s-1
pHTemp
°C
Rhodopsin kinase
(Bos taurus)
BDBM50260128
(CHEMBL4071638)
Show SMILES Fc1ccc(cc1C(=O)NCc1ccccc1C(F)(F)F)[C@@H]1CCNC[C@H]1COc1ccc2OCOc2c1 |r|
Show InChI InChI=1S/C28H26F4N2O4/c29-24-7-5-17(11-22(24)27(35)34-14-18-3-1-2-4-23(18)28(30,31)32)21-9-10-33-13-19(21)15-36-20-6-8-25-26(12-20)38-16-37-25/h1-8,11-12,19,21,33H,9-10,13-16H2,(H,34,35)/t19-,21-/m0/s1
n/an/a>1.00E+5n/an/an/an/an/an/a
Department of Medicinal Chemistry, College of Pharmacy,?Departments of Pharmacology and Biological Chemistry, Life Sciences Institute,§Ph.D. Program in Chemical Biology,?Vahlteich Medicinal Chemistry
Curated by ChEMBL
Assay Description
Inhibitory concentration against beta-glucosidase
J Med Chem 60: 3052-3069 (2017)
Article DOI: 10.1021/acs.jmedchem.7b00112
BindingDB Entry DOI: 10.7270/Q2M047XQ
Beta-adrenergic receptor kinase 1
(Bos taurus)
BDBM50260128
(CHEMBL4071638)
Show SMILES Fc1ccc(cc1C(=O)NCc1ccccc1C(F)(F)F)[C@@H]1CCNC[C@H]1COc1ccc2OCOc2c1 |r|
Show InChI InChI=1S/C28H26F4N2O4/c29-24-7-5-17(11-22(24)27(35)34-14-18-3-1-2-4-23(18)28(30,31)32)21-9-10-33-13-19(21)15-36-20-6-8-25-26(12-20)38-16-37-25/h1-8,11-12,19,21,33H,9-10,13-16H2,(H,34,35)/t19-,21-/m0/s1
n/an/a 1.24E+4n/an/an/an/an/an/a
Department of Medicinal Chemistry, College of Pharmacy,?Departments of Pharmacology and Biological Chemistry, Life Sciences Institute,§Ph.D. Program in Chemical Biology,?Vahlteich Medicinal Chemistry
Curated by ChEMBL
Assay Description
Inhibition of bovine GRK2 S670A mutant after 5 mins in presence of ATP by phosphorimaging assay
J Med Chem 60: 3052-3069 (2017)
Article DOI: 10.1021/acs.jmedchem.7b00112
BindingDB Entry DOI: 10.7270/Q2M047XQ
G protein-coupled receptor kinase 5
(Bos taurus)
BDBM50260128
(CHEMBL4071638)
Show SMILES Fc1ccc(cc1C(=O)NCc1ccccc1C(F)(F)F)[C@@H]1CCNC[C@H]1COc1ccc2OCOc2c1 |r|
Show InChI InChI=1S/C28H26F4N2O4/c29-24-7-5-17(11-22(24)27(35)34-14-18-3-1-2-4-23(18)28(30,31)32)21-9-10-33-13-19(21)15-36-20-6-8-25-26(12-20)38-16-37-25/h1-8,11-12,19,21,33H,9-10,13-16H2,(H,34,35)/t19-,21-/m0/s1
n/an/a 7.57E+4n/an/an/an/an/an/a
Department of Medicinal Chemistry, College of Pharmacy,?Departments of Pharmacology and Biological Chemistry, Life Sciences Institute,§Ph.D. Program in Chemical Biology,?Vahlteich Medicinal Chemistry
Curated by ChEMBL
Assay Description
Binding affinity of compound towards dopamine transporter determined using [3H]WIN-35 428 as radioligand
J Med Chem 60: 3052-3069 (2017)
Article DOI: 10.1021/acs.jmedchem.7b00112
BindingDB Entry DOI: 10.7270/Q2M047XQ