null
SMILES: COc1cc(OC)c(Cl)c(N2Cc3cnc(Nc4ccc(F)cc4)nc3N(C3CCN(CC3)C(=O)\C=C\CN(C)C)C2=O)c1Cl
InChI Key: InChIKey=PHTNPGCZALDYLD-AATRIKPKSA-N
Activity Spreadsheet -- Enzyme Inhibition Constant Data from BindingDB
Found 4 hits for monomerid = 50260182
Trg + Lig
Ki
nM
ΔG°
kcal/mole
IC50
nM
Kd
nM
EC50/IC50
nM
koff
s-1
kon
M-1s-1
pHTemp
°C
Fibroblast growth factor receptor 4
(Homo sapiens (Human))
BDBM50260182
(CHEMBL4092508)
Show SMILES COc1cc(OC)c(Cl)c(N2Cc3cnc(Nc4ccc(F)cc4)nc3N(C3CCN(CC3)C(=O)\C=C\CN(C)C)C2=O)c1Cl
Show InChI InChI=1S/C31H34Cl2FN7O4/c1-38(2)13-5-6-25(42)39-14-11-22(12-15-39)41-29-19(17-35-30(37-29)36-21-9-7-20(34)8-10-21)18-40(31(41)43)28-26(32)23(44-3)16-24(45-4)27(28)33/h5-10,16-17,22H,11-15,18H2,1-4H3,(H,35,36,37)/b6-5+
n/an/a 78n/an/an/an/an/an/a
Guangzhou Institutes of Biomedicine and Health
Curated by ChEMBL
Assay Description
Inhibition of human recombinant His-tagged FGFR4 cytoplasmic domain (781 to 1338 residues) expressed in baculovirus using Tyr-4 peptide after 1 hr by...
Eur J Med Chem 135: 531-543 (2017)
Article DOI: 10.1016/j.ejmech.2017.04.049
BindingDB Entry DOI: 10.7270/Q2K076QF
Fibroblast growth factor receptor 2
(Homo sapiens (Human))
BDBM50260182
(CHEMBL4092508)
Show SMILES COc1cc(OC)c(Cl)c(N2Cc3cnc(Nc4ccc(F)cc4)nc3N(C3CCN(CC3)C(=O)\C=C\CN(C)C)C2=O)c1Cl
Show InChI InChI=1S/C31H34Cl2FN7O4/c1-38(2)13-5-6-25(42)39-14-11-22(12-15-39)41-29-19(17-35-30(37-29)36-21-9-7-20(34)8-10-21)18-40(31(41)43)28-26(32)23(44-3)16-24(45-4)27(28)33/h5-10,16-17,22H,11-15,18H2,1-4H3,(H,35,36,37)/b6-5+
NCI pathway
Reactome pathway
n/an/a 1.5n/an/an/an/an/an/a
Guangzhou Institutes of Biomedicine and Health
Curated by ChEMBL
Assay Description
Inhibition of human recombinant cytoplasmic His-tagged FGFR2 (403 to 822 residues) expressed in baculovirus using Tyr-4 peptide after 1 hr by FRET-ba...
Eur J Med Chem 135: 531-543 (2017)
Article DOI: 10.1016/j.ejmech.2017.04.049
BindingDB Entry DOI: 10.7270/Q2K076QF
Fibroblast growth factor receptor 1
(Homo sapiens (Human))
BDBM50260182
(CHEMBL4092508)
Show SMILES COc1cc(OC)c(Cl)c(N2Cc3cnc(Nc4ccc(F)cc4)nc3N(C3CCN(CC3)C(=O)\C=C\CN(C)C)C2=O)c1Cl
Show InChI InChI=1S/C31H34Cl2FN7O4/c1-38(2)13-5-6-25(42)39-14-11-22(12-15-39)41-29-19(17-35-30(37-29)36-21-9-7-20(34)8-10-21)18-40(31(41)43)28-26(32)23(44-3)16-24(45-4)27(28)33/h5-10,16-17,22H,11-15,18H2,1-4H3,(H,35,36,37)/b6-5+
NCI pathway
Reactome pathway
n/an/a 0.990n/an/an/an/an/an/a
Guangzhou Institutes of Biomedicine and Health
Curated by ChEMBL
Assay Description
Inhibition of human recombinant His-tagged FGFR1 cytoplasmic domain (308 to 731 residues) expressed in baculovirus using Tyr-4 peptide after 1 hr by ...
Eur J Med Chem 135: 531-543 (2017)
Article DOI: 10.1016/j.ejmech.2017.04.049
BindingDB Entry DOI: 10.7270/Q2K076QF
Fibroblast growth factor receptor 3
(Homo sapiens (Human))
BDBM50260182
(CHEMBL4092508)
Show SMILES COc1cc(OC)c(Cl)c(N2Cc3cnc(Nc4ccc(F)cc4)nc3N(C3CCN(CC3)C(=O)\C=C\CN(C)C)C2=O)c1Cl
Show InChI InChI=1S/C31H34Cl2FN7O4/c1-38(2)13-5-6-25(42)39-14-11-22(12-15-39)41-29-19(17-35-30(37-29)36-21-9-7-20(34)8-10-21)18-40(31(41)43)28-26(32)23(44-3)16-24(45-4)27(28)33/h5-10,16-17,22H,11-15,18H2,1-4H3,(H,35,36,37)/b6-5+
Reactome pathway
n/an/a 5.10n/an/an/an/an/an/a
Guangzhou Institutes of Biomedicine and Health
Curated by ChEMBL
Assay Description
Inhibition of human recombinant His-tagged FGFR3 cytoplasmic domain (399 to 806 residues) expressed in baculovirus using Tyr-4 peptide after 1 hr by ...
Eur J Med Chem 135: 531-543 (2017)
Article DOI: 10.1016/j.ejmech.2017.04.049
BindingDB Entry DOI: 10.7270/Q2K076QF