null
SMILES: COc1cc(Nc2ncc3CN(C(=O)N(C4CCN(CC4)C(=O)\C=C\CN(C)C)c3n2)c2c(Cl)c(OC)cc(OC)c2Cl)ccc1F
InChI Key: InChIKey=CLUQPHUIWHLBAJ-VOTSOKGWSA-N
Activity Spreadsheet -- Enzyme Inhibition Constant Data from BindingDB
Found 1 hit for monomerid = 50260198
Trg + Lig
Ki
nM
ΔG°
kcal/mole
IC50
nM
Kd
nM
EC50/IC50
nM
koff
s-1
kon
M-1s-1
pHTemp
°C
Fibroblast growth factor receptor 1
(Homo sapiens (Human))
BDBM50260198
(CHEMBL4099403)
Show SMILES COc1cc(Nc2ncc3CN(C(=O)N(C4CCN(CC4)C(=O)\C=C\CN(C)C)c3n2)c2c(Cl)c(OC)cc(OC)c2Cl)ccc1F
Show InChI InChI=1S/C32H36Cl2FN7O5/c1-39(2)12-6-7-26(43)40-13-10-21(11-14-40)42-30-19(17-36-31(38-30)37-20-8-9-22(35)23(15-20)45-3)18-41(32(42)44)29-27(33)24(46-4)16-25(47-5)28(29)34/h6-9,15-17,21H,10-14,18H2,1-5H3,(H,36,37,38)/b7-6+
NCI pathway
Reactome pathway
n/an/a 2.30n/an/an/an/an/an/a
Guangzhou Institutes of Biomedicine and Health
Curated by ChEMBL
Assay Description
Inhibition of human recombinant His-tagged FGFR1 cytoplasmic domain (308 to 731 residues) expressed in baculovirus using Tyr-4 peptide after 1 hr by ...
Eur J Med Chem 135: 531-543 (2017)
Article DOI: 10.1016/j.ejmech.2017.04.049
BindingDB Entry DOI: 10.7270/Q2K076QF