null
SMILES: O[C@@H]1C[C@](C[C@@H](OC(=O)c2cc(O)c(O)c(O)c2)[C@H]1OC(=O)c1cc(O)c(O)c(O)c1)(OC(=O)c1cc(O)c(O)c(O)c1)C(O)=O
InChI Key: InChIKey=MFFWGSMFANTCDY-UVLHBTOWSA-N
Activity Spreadsheet -- Enzyme Inhibition Constant Data from BindingDB
Found 1 hit for monomerid = 50260504
Trg + Lig
Ki
nM
ΔG°
kcal/mole
IC50
nM
Kd
nM
EC50/IC50
nM
koff
s-1
kon
M-1s-1
pHTemp
°C
O94806/P05129/P05771/P17252/P24723/P41743/Q02156/Q04759/Q05513/Q05655/Q15139
(Homo sapiens (Human))
BDBM50260504
(CHEMBL309733)
Show SMILES O[C@@H]1C[C@](C[C@@H](OC(=O)c2cc(O)c(O)c(O)c2)[C@H]1OC(=O)c1cc(O)c(O)c(O)c1)(OC(=O)c1cc(O)c(O)c(O)c1)C(O)=O |r|
Show InChI InChI=1S/C28H24O18/c29-12-1-9(2-13(30)20(12)36)24(39)44-19-8-28(27(42)43,46-26(41)11-5-16(33)22(38)17(34)6-11)7-18(35)23(19)45-25(40)10-3-14(31)21(37)15(32)4-10/h1-6,18-19,23,29-38H,7-8H2,(H,42,43)/t18-,19-,23+,28-/m1/s1
n/an/a>1.00E+5n/an/an/an/an/an/a
TBA
Assay Description
Inhibitory activity against protein kinase C (PKC)
Citation and Details
Article DOI: 10.1016/S0960-894X(01)81072-6
BindingDB Entry DOI: 10.7270/Q2G44T0S