null
SMILES: Cc1noc(n1)[C@@H](NC(=O)n1c2ccccc2n(CCN2CCOCC2)c1=O)C(C)(C)C
InChI Key: InChIKey=JKOKWNBLJPOKNE-GOSISDBHSA-N
Activity Spreadsheet -- Enzyme Inhibition Constant Data from BindingDB
Found 2 hits for monomerid = 50260674
Trg + Lig
Ki
nM
ΔG°
kcal/mole
IC50
nM
Kd
nM
EC50/IC50
nM
koff
s-1
kon
M-1s-1
pHTemp
°C
Cannabinoid receptor 2
(Homo sapiens (Human))
BDBM50260674
((S)-N-(2,2-dimethyl-1-(3-methyl-1,2,4-oxadiazol-5-...)
Show SMILES Cc1noc(n1)[C@@H](NC(=O)n1c2ccccc2n(CCN2CCOCC2)c1=O)C(C)(C)C |r|
Show InChI InChI=1S/C22H30N6O4/c1-15-23-19(32-25-15)18(22(2,3)4)24-20(29)28-17-8-6-5-7-16(17)27(21(28)30)10-9-26-11-13-31-14-12-26/h5-8,18H,9-14H2,1-4H3,(H,24,29)/t18-/m1/s1
Reactome pathway
15n/an/an/an/an/an/an/an/a
Pfizer Inc.
Curated by ChEMBL
Assay Description
Displacement of [3H]CP-55940 from human CB2 receptor
Bioorg Med Chem Lett 18: 3310-4 (2008)
Article DOI: 10.1016/j.bmcl.2008.04.032
BindingDB Entry DOI: 10.7270/Q2VD70C3
Cannabinoid receptor 1
(Homo sapiens (Human))
BDBM50260674
((S)-N-(2,2-dimethyl-1-(3-methyl-1,2,4-oxadiazol-5-...)
Show SMILES Cc1noc(n1)[C@@H](NC(=O)n1c2ccccc2n(CCN2CCOCC2)c1=O)C(C)(C)C |r|
Show InChI InChI=1S/C22H30N6O4/c1-15-23-19(32-25-15)18(22(2,3)4)24-20(29)28-17-8-6-5-7-16(17)27(21(28)30)10-9-26-11-13-31-14-12-26/h5-8,18H,9-14H2,1-4H3,(H,24,29)/t18-/m1/s1
NCI pathway
Reactome pathway
n/an/a>1.00E+4n/an/an/an/an/an/a
Pfizer Inc.
Curated by ChEMBL
Assay Description
Displacement of [3H]SR141716A from human CB1 receptor
Bioorg Med Chem Lett 18: 3310-4 (2008)
Article DOI: 10.1016/j.bmcl.2008.04.032
BindingDB Entry DOI: 10.7270/Q2VD70C3