BDBM50261149 (S)-3-Amino-5-(2-(1-methoxypropan-2-ylamino)-6-(4-(trifluoromethyl)phenyl)pyrimidin-4-yloxy)quinoxalin-2(1H)-one::CHEMBL494796
SMILES: COC[C@H](C)Nc1nc(Oc2cccc3[nH]c(=O)c(N)nc23)cc(n1)-c1ccc(cc1)C(F)(F)F
InChI Key: InChIKey=JRFCLGQHXPJZTB-LBPRGKRZSA-N
Data: 2 IC50
Activity Spreadsheet -- Enzyme Inhibition Constant Data from BindingDB
Found 2 hits for monomerid = 50261149
Trg + Lig
Ki
nM
ΔG°
kcal/mole
IC50
nM
Kd
nM
EC50/IC50
nM
koff
s-1
kon
M-1s-1
pHTemp
°C
Vanilloid receptor
(Rattus norvegicus (rat))
BDBM50261149
((S)-3-Amino-5-(2-(1-methoxypropan-2-ylamino)-6-(4-...)
Show SMILES COC[C@H](C)Nc1nc(Oc2cccc3[nH]c(=O)c(N)nc23)cc(n1)-c1ccc(cc1)C(F)(F)F |r|
Show InChI InChI=1S/C23H21F3N6O3/c1-12(11-34-2)28-22-30-16(13-6-8-14(9-7-13)23(24,25)26)10-18(31-22)35-17-5-3-4-15-19(17)32-20(27)21(33)29-15/h3-10,12H,11H2,1-2H3,(H2,27,32)(H,29,33)(H,28,30,31)/t12-/m0/s1
Reactome pathway
n/an/a 1n/an/an/an/an/an/a
Amgen, Inc.
Curated by ChEMBL
Assay Description
Antagonist activity at rat TRPV1 expressed in CHO cells assessed as inhibition of capsaicin-induced calcium influx
J Med Chem 51: 2744-57 (2008)
Article DOI: 10.1021/jm7014638
BindingDB Entry DOI: 10.7270/Q2930SZH
Vanilloid receptor
(Rattus norvegicus (rat))
BDBM50261149
((S)-3-Amino-5-(2-(1-methoxypropan-2-ylamino)-6-(4-...)
Show SMILES COC[C@H](C)Nc1nc(Oc2cccc3[nH]c(=O)c(N)nc23)cc(n1)-c1ccc(cc1)C(F)(F)F |r|
Show InChI InChI=1S/C23H21F3N6O3/c1-12(11-34-2)28-22-30-16(13-6-8-14(9-7-13)23(24,25)26)10-18(31-22)35-17-5-3-4-15-19(17)32-20(27)21(33)29-15/h3-10,12H,11H2,1-2H3,(H2,27,32)(H,29,33)(H,28,30,31)/t12-/m0/s1
Reactome pathway
n/an/a 0.800n/an/an/an/an/an/a
Amgen, Inc.
Curated by ChEMBL
Assay Description
Antagonist activity at rat TRPV1 expressed in CHO cells assessed as inhibition of capsaicin-induced calcium influx
J Med Chem 51: 2744-57 (2008)
Article DOI: 10.1021/jm7014638
BindingDB Entry DOI: 10.7270/Q2930SZH