BDBM50261669 CHEMBL4084641
SMILES: C[C@@H](N[C@H]1CCN(C1)c1ccc(cc1)S(=O)(=O)NCCn1cnc(C(O)=O)c1C(O)=O)c1cccc2ccccc12
InChI Key: InChIKey=XQVAZARINDDSNF-CTNGQTDRSA-N
Data: 1 EC50
Activity Spreadsheet -- Enzyme Inhibition Constant Data from BindingDB
Found 1 hit for monomerid = 50261669
Trg + Lig
Ki
nM
ΔG°
kcal/mole
IC50
nM
Kd
nM
EC50/IC50
nM
koff
s-1
kon
M-1s-1
pHTemp
°C
Calcium-sensing receptor (CaSR)
(Homo sapiens (Human))
BDBM50261669
(CHEMBL4084641)
Show SMILES C[C@@H](N[C@H]1CCN(C1)c1ccc(cc1)S(=O)(=O)NCCn1cnc(C(O)=O)c1C(O)=O)c1cccc2ccccc12 |r|
Show InChI InChI=1S/C29H31N5O6S/c1-19(24-8-4-6-20-5-2-3-7-25(20)24)32-21-13-15-33(17-21)22-9-11-23(12-10-22)41(39,40)31-14-16-34-18-30-26(28(35)36)27(34)29(37)38/h2-12,18-19,21,31-32H,13-17H2,1H3,(H,35,36)(H,37,38)/t19-,21+/m1/s1
n/an/an/an/a 7.90n/an/an/an/a
Enteroendocrine Discovery Performance Unit and Platform Technologies and Science, GlaxoSmithKline, 5 Moore Drive, Research Triangle Park, NC 27709, United States. Electronic address: ssparks@viamet.c
Curated by ChEMBL
Assay Description
Displacement of [3H]CP55940 from mouse brain CB2 receptor expressed in HEK293 cells
Bioorg Med Chem Lett 27: 4673-4677 (2017)
Article DOI: 10.1016/j.bmcl.2017.09.008
BindingDB Entry DOI: 10.7270/Q29889FR