BDBM50261674 CHEMBL4086045
SMILES: C[C@@H](N[C@H]1CCN(C1)c1ccc(cc1)C(=O)NCCn1cnc(C(O)=O)c1C(O)=O)c1cccc2ccccc12
InChI Key: InChIKey=AFWCUGLIYQIVRN-KNQAVFIVSA-N
Data: 1 EC50
Activity Spreadsheet -- Enzyme Inhibition Constant Data from BindingDB
Found 1 hit for monomerid = 50261674
Trg + Lig
Ki
nM
ΔG°
kcal/mole
IC50
nM
Kd
nM
EC50/IC50
nM
koff
s-1
kon
M-1s-1
pHTemp
°C
Calcium-sensing receptor (CaSR)
(Homo sapiens (Human))
BDBM50261674
(CHEMBL4086045)
Show SMILES C[C@@H](N[C@H]1CCN(C1)c1ccc(cc1)C(=O)NCCn1cnc(C(O)=O)c1C(O)=O)c1cccc2ccccc12 |r|
Show InChI InChI=1S/C30H31N5O5/c1-19(24-8-4-6-20-5-2-3-7-25(20)24)33-22-13-15-34(17-22)23-11-9-21(10-12-23)28(36)31-14-16-35-18-32-26(29(37)38)27(35)30(39)40/h2-12,18-19,22,33H,13-17H2,1H3,(H,31,36)(H,37,38)(H,39,40)/t19-,22+/m1/s1
n/an/an/an/a 5n/an/an/an/a
Enteroendocrine Discovery Performance Unit and Platform Technologies and Science, GlaxoSmithKline, 5 Moore Drive, Research Triangle Park, NC 27709, United States. Electronic address: ssparks@viamet.c
Curated by ChEMBL
Assay Description
Displacement of [3H]CP55940 from mouse brain CB2 receptor expressed in HEK293 cells
Bioorg Med Chem Lett 27: 4673-4677 (2017)
Article DOI: 10.1016/j.bmcl.2017.09.008
BindingDB Entry DOI: 10.7270/Q29889FR