BDBM50261982 CHEMBL4094923
SMILES: Cc1cc([nH]n1)-c1nc(no1)C1(CCC1)c1ccc(cc1)-c1cnc(N)nc1
InChI Key: InChIKey=IMTBBQKIJHZMFT-UHFFFAOYSA-N
Data: 2 IC50
Activity Spreadsheet -- Enzyme Inhibition Constant Data from BindingDB
Found 2 hits for monomerid = 50261982
Trg + Lig
Ki
nM
ΔG°
kcal/mole
IC50
nM
Kd
nM
EC50/IC50
nM
koff
s-1
kon
M-1s-1
pHTemp
°C
Arachidonate 5-lipoxygenase-activating protein
(Homo sapiens (Human))
BDBM50261982
(CHEMBL4094923)
Show SMILES Cc1cc([nH]n1)-c1nc(no1)C1(CCC1)c1ccc(cc1)-c1cnc(N)nc1
Show InChI InChI=1S/C20H19N7O/c1-12-9-16(26-25-12)17-24-18(27-28-17)20(7-2-8-20)15-5-3-13(4-6-15)14-10-22-19(21)23-11-14/h3-6,9-11H,2,7-8H2,1H3,(H,25,26)(H2,21,22,23)
Reactome pathway
n/an/a 80n/an/an/an/an/an/a
Small Molecule Discovery Research, Boehringer Ingelheim Pharmaceuticals, Inc., 900 Ridgebury Road, P.O. Box 368, Ridgefield, CT 06877-0368, USA. Electronic address: abartolozzi@gmail.com.
Curated by ChEMBL
Assay Description
Inhibition of FLAP in calcimycin-stimulated human whole blood assessed as reduction in LTB4 production pretreated for 15 mins followed by calcimycin ...
Bioorg Med Chem Lett 27: 4652-4659 (2017)
Article DOI: 10.1016/j.bmcl.2017.09.007
BindingDB Entry DOI: 10.7270/Q2HQ42CS
Arachidonate 5-lipoxygenase-activating protein
(Homo sapiens (Human))
BDBM50261982
(CHEMBL4094923)
Show SMILES Cc1cc([nH]n1)-c1nc(no1)C1(CCC1)c1ccc(cc1)-c1cnc(N)nc1
Show InChI InChI=1S/C20H19N7O/c1-12-9-16(26-25-12)17-24-18(27-28-17)20(7-2-8-20)15-5-3-13(4-6-15)14-10-22-19(21)23-11-14/h3-6,9-11H,2,7-8H2,1H3,(H,25,26)(H2,21,22,23)
Reactome pathway
n/an/a 2.40n/an/an/an/an/an/a
Small Molecule Discovery Research, Boehringer Ingelheim Pharmaceuticals, Inc., 900 Ridgebury Road, P.O. Box 368, Ridgefield, CT 06877-0368, USA. Electronic address: abartolozzi@gmail.com.
Curated by ChEMBL
Assay Description
Displacement of [125I]-L-691831 from human FLAP expressed in Sf9 cell membranes after 2 hrs by Topcount method
Bioorg Med Chem Lett 27: 4652-4659 (2017)
Article DOI: 10.1016/j.bmcl.2017.09.007
BindingDB Entry DOI: 10.7270/Q2HQ42CS