null
SMILES: Cc1ccc2c(c[nH]c2c1)C(=O)c1ccccc1NCc1ccc2cn[nH]c2c1
InChI Key: InChIKey=PATZLRMJVHUMJZ-UHFFFAOYSA-N
Activity Spreadsheet -- Enzyme Inhibition Constant Data from BindingDB
Found 2 hits for monomerid = 50262274
Trg + Lig
Ki
nM
ΔG°
kcal/mole
IC50
nM
Kd
nM
EC50/IC50
nM
koff
s-1
kon
M-1s-1
pHTemp
°C
Vascular endothelial growth factor receptor 2
(Homo sapiens (Human))
BDBM50262274
((2-((1H-indazol-6-yl)methylamino)phenyl)(6-methyl-...)
Show SMILES Cc1ccc2c(c[nH]c2c1)C(=O)c1ccccc1NCc1ccc2cn[nH]c2c1
Show InChI InChI=1S/C24H20N4O/c1-15-6-9-18-20(14-26-23(18)10-15)24(29)19-4-2-3-5-21(19)25-12-16-7-8-17-13-27-28-22(17)11-16/h2-11,13-14,25-26H,12H2,1H3,(H,27,28)
NCI pathway
Reactome pathway
n/an/a 76n/an/an/an/an/an/a
ImClone Systems Inc
Curated by ChEMBL
Assay Description
Inhibition of KDR (unknown origin) autophosphorylation by cell based assay
Bioorg Med Chem Lett 18: 4344-7 (2008)
Article DOI: 10.1016/j.bmcl.2008.06.083
BindingDB Entry DOI: 10.7270/Q2542NF0
Vascular endothelial growth factor receptor 2
(Homo sapiens (Human))
BDBM50262274
((2-((1H-indazol-6-yl)methylamino)phenyl)(6-methyl-...)
Show SMILES Cc1ccc2c(c[nH]c2c1)C(=O)c1ccccc1NCc1ccc2cn[nH]c2c1
Show InChI InChI=1S/C24H20N4O/c1-15-6-9-18-20(14-26-23(18)10-15)24(29)19-4-2-3-5-21(19)25-12-16-7-8-17-13-27-28-22(17)11-16/h2-11,13-14,25-26H,12H2,1H3,(H,27,28)
NCI pathway
Reactome pathway
n/an/a 250n/an/an/an/an/an/a
ImClone Systems Inc
Curated by ChEMBL
Assay Description
Inhibition of KDR (unknown origin) by HTRF assay
Bioorg Med Chem Lett 18: 4344-7 (2008)
Article DOI: 10.1016/j.bmcl.2008.06.083
BindingDB Entry DOI: 10.7270/Q2542NF0