null
SMILES: Fc1ccc2c(c[nH]c2c1)C(=O)c1ccccc1NCc1ccc2cn[nH]c2c1
InChI Key: InChIKey=AWUNNFGBNUISKG-UHFFFAOYSA-N
Activity Spreadsheet -- Enzyme Inhibition Constant Data from BindingDB
Found 2 hits for monomerid = 50262278
Trg + Lig
Ki
nM
ΔG°
kcal/mole
IC50
nM
Kd
nM
EC50/IC50
nM
koff
s-1
kon
M-1s-1
pHTemp
°C
Vascular endothelial growth factor receptor 2
(Homo sapiens (Human))
BDBM50262278
((2-((1H-indazol-6-yl)methylamino)phenyl)(6-fluoro-...)
Show SMILES Fc1ccc2c(c[nH]c2c1)C(=O)c1ccccc1NCc1ccc2cn[nH]c2c1
Show InChI InChI=1S/C23H17FN4O/c24-16-7-8-17-19(13-26-22(17)10-16)23(29)18-3-1-2-4-20(18)25-11-14-5-6-15-12-27-28-21(15)9-14/h1-10,12-13,25-26H,11H2,(H,27,28)
NCI pathway
Reactome pathway
n/an/a 250n/an/an/an/an/an/a
ImClone Systems Inc
Curated by ChEMBL
Assay Description
Inhibition of KDR (unknown origin) autophosphorylation by cell based assay
Bioorg Med Chem Lett 18: 4344-7 (2008)
Article DOI: 10.1016/j.bmcl.2008.06.083
BindingDB Entry DOI: 10.7270/Q2542NF0
Vascular endothelial growth factor receptor 2
(Homo sapiens (Human))
BDBM50262278
((2-((1H-indazol-6-yl)methylamino)phenyl)(6-fluoro-...)
Show SMILES Fc1ccc2c(c[nH]c2c1)C(=O)c1ccccc1NCc1ccc2cn[nH]c2c1
Show InChI InChI=1S/C23H17FN4O/c24-16-7-8-17-19(13-26-22(17)10-16)23(29)18-3-1-2-4-20(18)25-11-14-5-6-15-12-27-28-21(15)9-14/h1-10,12-13,25-26H,11H2,(H,27,28)
NCI pathway
Reactome pathway
n/an/a 1.50E+3n/an/an/an/an/an/a
ImClone Systems Inc
Curated by ChEMBL
Assay Description
Inhibition of KDR (unknown origin) by HTRF assay
Bioorg Med Chem Lett 18: 4344-7 (2008)
Article DOI: 10.1016/j.bmcl.2008.06.083
BindingDB Entry DOI: 10.7270/Q2542NF0